BDBM14966 3-(2-(6-Aminopyridin-3-yl)ethynyl)-4-methyl-N-(3-(trifluoromethyl)phenyl)benzamide::3-[2-(6-aminopyridin-3-yl)ethynyl]-4-methyl-N-[3-(trifluoromethyl)phenyl]benzamide::heterocyclic akynyl amide 13a
SMILES: Cc1ccc(cc1C#Cc1ccc(N)nc1)C(=O)Nc1cccc(c1)C(F)(F)F
InChI Key: InChIKey=CREAAGUFOMLCKF-UHFFFAOYSA-N
Data: 3 IC50
Activity Spreadsheet -- Enzyme Inhibition Constant Data from BindingDB
Found 3 hits for monomerid = 14966
Trg + Lig
Ki
nM
ΔG°
kcal/mole
IC50
nM
Kd
nM
EC50/IC50
nM
koff
s-1
kon
M-1s-1
pHTemp
°C
Angiopoietin-1 receptor
(Homo sapiens (Human))
BDBM14966
(3-(2-(6-Aminopyridin-3-yl)ethynyl)-4-methyl-N-(3-(...)
Show SMILES Cc1ccc(cc1C#Cc1ccc(N)nc1)C(=O)Nc1cccc(c1)C(F)(F)F
Show InChI InChI=1S/C22H16F3N3O/c1-14-5-8-17(11-16(14)9-6-15-7-10-20(26)27-13-15)21(29)28-19-4-2-3-18(12-19)22(23,24)25/h2-5,7-8,10-13H,1H3,(H2,26,27)(H,28,29)
n/an/a 3n/an/an/an/a7.522
Amgen
Assay Description
The assay uses purified enzyme interacting with biotinylated peptide substrate. HTRF is based on the proximity of europium cryptate (donor fluorophor...
J Med Chem 50: 627-40 (2007)
Article DOI: 10.1021/jm061112p
BindingDB Entry DOI: 10.7270/Q2R49P1Z
Lck
(Homo sapiens (Human))
BDBM14966
(3-(2-(6-Aminopyridin-3-yl)ethynyl)-4-methyl-N-(3-(...)
Show SMILES Cc1ccc(cc1C#Cc1ccc(N)nc1)C(=O)Nc1cccc(c1)C(F)(F)F
Show InChI InChI=1S/C22H16F3N3O/c1-14-5-8-17(11-16(14)9-6-15-7-10-20(26)27-13-15)21(29)28-19-4-2-3-18(12-19)22(23,24)25/h2-5,7-8,10-13H,1H3,(H2,26,27)(H,28,29)
n/an/a 1n/an/an/an/an/an/a
Amgen
Assay Description
The assay uses purified enzyme interacting with biotinylated peptide substrate. HTRF is based on the proximity of europium cryptate (donor fluorophor...
J Med Chem 50: 627-40 (2007)
Article DOI: 10.1021/jm061112p
BindingDB Entry DOI: 10.7270/Q2R49P1Z
Vascular endothelial growth factor receptor 2
(Homo sapiens (Human))
BDBM14966
(3-(2-(6-Aminopyridin-3-yl)ethynyl)-4-methyl-N-(3-(...)
Show SMILES Cc1ccc(cc1C#Cc1ccc(N)nc1)C(=O)Nc1cccc(c1)C(F)(F)F
Show InChI InChI=1S/C22H16F3N3O/c1-14-5-8-17(11-16(14)9-6-15-7-10-20(26)27-13-15)21(29)28-19-4-2-3-18(12-19)22(23,24)25/h2-5,7-8,10-13H,1H3,(H2,26,27)(H,28,29)
NCI pathway
Reactome pathway
n/an/a 1n/an/an/an/an/an/a
Amgen
Assay Description
The assay uses purified enzyme interacting with biotinylated peptide substrate. HTRF is based on the proximity of europium cryptate (donor fluorophor...
J Med Chem 50: 627-40 (2007)
Article DOI: 10.1021/jm061112p
BindingDB Entry DOI: 10.7270/Q2R49P1Z