BDBM149709 US8975409, Example 19
SMILES: CC(C)CC1(O)CN(C1)C(=O)Nc1cc(Oc2ccc(F)cc2)cc(Oc2ccc(cc2)C(C)(C)C(O)=O)c1
InChI Key: InChIKey=HKSAGIGRQWXHMH-UHFFFAOYSA-N
Data: 3 IC50
Activity Spreadsheet -- Enzyme Inhibition Constant Data from BindingDB
Found 3 hits for monomerid = 149709
Trg + Lig
Ki
nM
ΔG°
kcal/mole
IC50
nM
Kd
nM
EC50/IC50
nM
koff
s-1
kon
M-1s-1
pHTemp
°C
Sphingosine 1-phosphate receptor 2
(Homo sapiens (Human))
BDBM149709
(US8975409, Example 19)
Show SMILES CC(C)CC1(O)CN(C1)C(=O)Nc1cc(Oc2ccc(F)cc2)cc(Oc2ccc(cc2)C(C)(C)C(O)=O)c1
Show InChI InChI=1S/C30H33FN2O6/c1-19(2)16-30(37)17-33(18-30)28(36)32-22-13-25(15-26(14-22)39-24-11-7-21(31)8-12-24)38-23-9-5-20(6-10-23)29(3,4)27(34)35/h5-15,19,37H,16-18H2,1-4H3,(H,32,36)(H,34,35)
NCI pathway
Reactome pathway
US Patent
n/an/a 9.40n/an/an/an/a7.237
ONO Pharmaceutical Co., Ltd.
US Patent
Assay Description
Chinese hamster ovary (CHO) cells overexpressing the human S1P2 gene were cultured in a Ham's F12 medium containing 10% fetal bovine serum (FBS), an ...
US Patent US8975409 (2015)
BindingDB Entry DOI: 10.7270/Q2X34W60
Sphingosine 1-phosphate receptor 2
(Homo sapiens (Human))
BDBM149709
(US8975409, Example 19)
Show SMILES CC(C)CC1(O)CN(C1)C(=O)Nc1cc(Oc2ccc(F)cc2)cc(Oc2ccc(cc2)C(C)(C)C(O)=O)c1
Show InChI InChI=1S/C30H33FN2O6/c1-19(2)16-30(37)17-33(18-30)28(36)32-22-13-25(15-26(14-22)39-24-11-7-21(31)8-12-24)38-23-9-5-20(6-10-23)29(3,4)27(34)35/h5-15,19,37H,16-18H2,1-4H3,(H,32,36)(H,34,35)
NCI pathway
Reactome pathway
n/an/a 5.20n/an/an/an/an/an/a
Ono Pharmaceutical Co.
Curated by ChEMBL
Assay Description
Antagonist activity at S1P2 receptor (unknown origin) expressed in CHO cells assessed as inhibition of S1P-induced increase in intracellular calcium ...
Bioorg Med Chem Lett 26: 1209-13 (2016)
BindingDB Entry DOI: 10.7270/Q2ST7RQ6
Sphingosine 1-phosphate receptor 2 (S1P2)
(Rattus norvegicus (Rat))
BDBM149709
(US8975409, Example 19)
Show SMILES CC(C)CC1(O)CN(C1)C(=O)Nc1cc(Oc2ccc(F)cc2)cc(Oc2ccc(cc2)C(C)(C)C(O)=O)c1
Show InChI InChI=1S/C30H33FN2O6/c1-19(2)16-30(37)17-33(18-30)28(36)32-22-13-25(15-26(14-22)39-24-11-7-21(31)8-12-24)38-23-9-5-20(6-10-23)29(3,4)27(34)35/h5-15,19,37H,16-18H2,1-4H3,(H,32,36)(H,34,35)
US Patent
n/an/a 1.70n/an/an/an/a7.237
ONO Pharmaceutical Co., Ltd.
US Patent
Assay Description
Chinese hamster ovary (CHO) cells overexpressing the human S1P2 gene were cultured in a Ham's F12 medium containing 10% fetal bovine serum (FBS), an ...
US Patent US8975409 (2015)
BindingDB Entry DOI: 10.7270/Q2X34W60