BDBM15006 3-(4-{4-aminofuro[2,3-d]pyrimidin-5-yl}phenyl)-1-[3-(trifluoromethyl)phenyl]urea::4-amino-5-diarylurea-furo[2,3-d]pyrimidine 8d
SMILES: Nc1ncnc2occ(-c3ccc(NC(=O)Nc4cccc(c4)C(F)(F)F)cc3)c12
InChI Key: InChIKey=LSVIBAPJYUUVJJ-UHFFFAOYSA-N
Data: 5 IC50
PDB links: 1 PDB ID contains this monomer as substructures. 1 PDB ID contains inhibitors having a similarity of 90% to this monomer.
Activity Spreadsheet -- Enzyme Inhibition Constant Data from BindingDB
Found 5 hits for monomerid = 15006
Trg + Lig
Ki
nM
ΔG°
kcal/mole
IC50
nM
Kd
nM
EC50/IC50
nM
koff
s-1
kon
M-1s-1
pHTemp
°C
Angiopoietin-1 receptor
(Homo sapiens (Human))
BDBM15006
(3-(4-{4-aminofuro[2,3-d]pyrimidin-5-yl}phenyl)-1-[...)
Show SMILES Nc1ncnc2occ(-c3ccc(NC(=O)Nc4cccc(c4)C(F)(F)F)cc3)c12
Show InChI InChI=1S/C20H14F3N5O2/c21-20(22,23)12-2-1-3-14(8-12)28-19(29)27-13-6-4-11(5-7-13)15-9-30-18-16(15)17(24)25-10-26-18/h1-10H,(H2,24,25,26)(H2,27,28,29)
n/an/a 10.2n/an/an/an/a7.422
GlaxoSmithKline
Assay Description
The assay uses purified GST-Tie-2 or GST-6x His-VEGFR2 interacting with biotinylated peptide substrates. HTRF is based on the proximity of europium c...
Bioorg Med Chem Lett 17: 1773-8 (2007)
Article DOI: 10.1016/j.bmcl.2006.12.077
BindingDB Entry DOI: 10.7270/Q2GM85JF
Vascular endothelial growth factor receptor 2
(Homo sapiens (Human))
BDBM15006
(3-(4-{4-aminofuro[2,3-d]pyrimidin-5-yl}phenyl)-1-[...)
Show SMILES Nc1ncnc2occ(-c3ccc(NC(=O)Nc4cccc(c4)C(F)(F)F)cc3)c12
Show InChI InChI=1S/C20H14F3N5O2/c21-20(22,23)12-2-1-3-14(8-12)28-19(29)27-13-6-4-11(5-7-13)15-9-30-18-16(15)17(24)25-10-26-18/h1-10H,(H2,24,25,26)(H2,27,28,29)
NCI pathway
Reactome pathway
n/an/a 7.08n/an/an/an/a7.522
GlaxoSmithKline
Assay Description
The assay uses purified GST-Tie-2 or GST-6x His-VEGFR2 interacting with biotinylated peptide substrates. HTRF is based on the proximity of europium c...
Bioorg Med Chem Lett 17: 1773-8 (2007)
Article DOI: 10.1016/j.bmcl.2006.12.077
BindingDB Entry DOI: 10.7270/Q2GM85JF
Receptor-interacting serine/threonine-protein kinase 1
(Homo sapiens (Human))
BDBM15006
(3-(4-{4-aminofuro[2,3-d]pyrimidin-5-yl}phenyl)-1-[...)
Show SMILES Nc1ncnc2occ(-c3ccc(NC(=O)Nc4cccc(c4)C(F)(F)F)cc3)c12
Show InChI InChI=1S/C20H14F3N5O2/c21-20(22,23)12-2-1-3-14(8-12)28-19(29)27-13-6-4-11(5-7-13)15-9-30-18-16(15)17(24)25-10-26-18/h1-10H,(H2,24,25,26)(H2,27,28,29)
n/an/a 10n/an/an/an/an/an/a
GlaxoSmithKline
Curated by ChEMBL
Assay Description
Inhibition of human N-terminal His-GST-TEV-fused RIP1 kinase domain (1 to 375) autophosphorylation expressed in baculovirus infected insect Sf9 cells...
ACS Med Chem Lett 4: 1238-43 (2013)
Article DOI: 10.1021/ml400382p
BindingDB Entry DOI: 10.7270/Q2C24XW2
Receptor-interacting serine/threonine-protein kinase 1
(Homo sapiens (Human))
BDBM15006
(3-(4-{4-aminofuro[2,3-d]pyrimidin-5-yl}phenyl)-1-[...)
Show SMILES Nc1ncnc2occ(-c3ccc(NC(=O)Nc4cccc(c4)C(F)(F)F)cc3)c12
Show InChI InChI=1S/C20H14F3N5O2/c21-20(22,23)12-2-1-3-14(8-12)28-19(29)27-13-6-4-11(5-7-13)15-9-30-18-16(15)17(24)25-10-26-18/h1-10H,(H2,24,25,26)(H2,27,28,29)
n/an/a 1.00E+3n/an/an/an/an/an/a
GlaxoSmithKline
Curated by ChEMBL
Assay Description
Inhibition of RIP1 in human U937 cells assessed as prevention of TNFalpha/zVAD.fmk-induced necrotic cell death preincubated for 30 to 60 mins followe...
ACS Med Chem Lett 4: 1238-43 (2013)
Article DOI: 10.1021/ml400382p
BindingDB Entry DOI: 10.7270/Q2C24XW2
Receptor-interacting serine/threonine-protein kinase 1
(Homo sapiens (Human))
BDBM15006
(3-(4-{4-aminofuro[2,3-d]pyrimidin-5-yl}phenyl)-1-[...)
Show SMILES Nc1ncnc2occ(-c3ccc(NC(=O)Nc4cccc(c4)C(F)(F)F)cc3)c12
Show InChI InChI=1S/C20H14F3N5O2/c21-20(22,23)12-2-1-3-14(8-12)28-19(29)27-13-6-4-11(5-7-13)15-9-30-18-16(15)17(24)25-10-26-18/h1-10H,(H2,24,25,26)(H2,27,28,29)
n/an/a 20n/an/an/an/an/an/a
GlaxoSmithKline
Curated by ChEMBL
Assay Description
Displacement of (14-(2-{[3-({2-{[4-(cyanomethyl)phenyl]amino}-6-[(5-cyclopropyl-1H-pyrazol-3-yl)amino]-4-pyrimidinyl}amino)propyl]amino}-2-oxoethyl)-...
ACS Med Chem Lett 4: 1238-43 (2013)
Article DOI: 10.1021/ml400382p
BindingDB Entry DOI: 10.7270/Q2C24XW2