null
SMILES: CCN(Cc1ccccn1)C(=O)Cc1c(nc2cc(C)ccn12)-c1ccc(Cl)c(Cl)c1
InChI Key: InChIKey=ILPWQHIEKZASOY-UHFFFAOYSA-N
Activity Spreadsheet -- Enzyme Inhibition Constant Data from BindingDB
Found 1 hit for monomerid = 150166
Trg + Lig
Ki
nM
ΔG°
kcal/mole
IC50
nM
Kd
nM
EC50/IC50
nM
koff
s-1
kon
M-1s-1
pHTemp
°C
Translocator protein
(Rattus norvegicus (rat))
BDBM150166
(US8980887, Compound 8)
Show SMILES CCN(Cc1ccccn1)C(=O)Cc1c(nc2cc(C)ccn12)-c1ccc(Cl)c(Cl)c1
Show InChI InChI=1S/C24H22Cl2N4O/c1-3-29(15-18-6-4-5-10-27-18)23(31)14-21-24(17-7-8-19(25)20(26)13-17)28-22-12-16(2)9-11-30(21)22/h4-13H,3,14-15H2,1-2H3
US Patent
9.34 -11.1 21.9n/an/an/an/an/a30
Institute of Pharmacology; Toxicology Academy of Military Medical Sciences P.L.A., China
US Patent
Assay Description
Competitive Binding Test of Drug to the Receptor (Rat Heart TSPO) and Radioligand (3H-PK11195): (1) tubes were placed in reaction condition of 30 C.(...
US Patent US8980887 (2015)
BindingDB Entry DOI: 10.7270/Q2D50KP2