BDBM150172 US8980901, 117
SMILES: C[C@H](Nc1ncnc2[nH]cnc12)c1nc2ccccc2c(=O)n1-c1cccc(F)c1
InChI Key:
Data: 1 IC50
Activity Spreadsheet -- Enzyme Inhibition Constant Data from BindingDB
Found 1 hit for monomerid = 150172
Trg + Lig
Ki
nM
ΔG°
kcal/mole
IC50
nM
Kd
nM
EC50/IC50
nM
koff
s-1
kon
M-1s-1
pHTemp
°C
Phosphatidylinositol 4,5-bisphosphate 3-kinase catalytic subunit delta isoform
(Homo sapiens (Human))
BDBM150172
(US8980901, 117)
Show SMILES C[C@H](Nc1ncnc2[nH]cnc12)c1nc2ccccc2c(=O)n1-c1cccc(F)c1 |r|
NCI pathway
Reactome pathway
US Patent
n/an/a 12n/an/an/an/an/an/a
Icos Corporation
US Patent
Assay Description
Using the method described in Example 2, compounds of the invention were tested for inhibitory activity and potency against PI3Kdelta, and for sele...
US Patent US8980901 (2015)
BindingDB Entry DOI: 10.7270/Q28C9V0N