null
SMILES: Cc1ncc(n1CCOS(=O)(=O)ON)[N+]([O-])=O
InChI Key: InChIKey=YZWMPVHXWBGMRV-UHFFFAOYSA-N
Activity Spreadsheet -- Enzyme Inhibition Constant Data from BindingDB
Found 4 hits for monomerid = 150247
Trg + Lig
Ki
nM
ΔG°
kcal/mole
IC50
nM
Kd
nM
EC50/IC50
nM
koff
s-1
kon
M-1s-1
pHTemp
°C
Carbonic anhydrase 9
(Homo sapiens (Human))
BDBM150247
(US8980932, 9 (DH338))
Show SMILES Cc1ncc(n1CCOS(=O)(=O)ON)[N+]([O-])=O
Show InChI InChI=1S/C6H10N4O6S/c1-5-8-4-6(10(11)12)9(5)2-3-15-17(13,14)16-7/h4H,2-3,7H2,1H3
NCI pathway
Reactome pathway
US Patent
8.30n/an/an/an/an/an/a7.5n/a
Stichting Maastricht Radiation Oncology “Maastro-Clinic”; Université Montpellier 2 Sciences et Techniques
US Patent
Assay Description
The inhibition constants (K) the compounds for four CA isozymes, CA I, II, IX and XII were determined. An Applied Photophysics (Oxford, UK) stopped-f...
US Patent US8980932 (2015)
BindingDB Entry DOI: 10.7270/Q2GX499J
Carbonic anhydrase 12
(Homo sapiens (Human))
BDBM150247
(US8980932, 9 (DH338))
Show SMILES Cc1ncc(n1CCOS(=O)(=O)ON)[N+]([O-])=O
Show InChI InChI=1S/C6H10N4O6S/c1-5-8-4-6(10(11)12)9(5)2-3-15-17(13,14)16-7/h4H,2-3,7H2,1H3
Reactome pathway
US Patent
8.90n/an/an/an/an/an/a7.5n/a
Stichting Maastricht Radiation Oncology “Maastro-Clinic”; Université Montpellier 2 Sciences et Techniques
US Patent
Assay Description
The inhibition constants (K) the compounds for four CA isozymes, CA I, II, IX and XII were determined. An Applied Photophysics (Oxford, UK) stopped-f...
US Patent US8980932 (2015)
BindingDB Entry DOI: 10.7270/Q2GX499J
Carbonic anhydrase 2
(Homo sapiens (Human))
BDBM150247
(US8980932, 9 (DH338))
Show SMILES Cc1ncc(n1CCOS(=O)(=O)ON)[N+]([O-])=O
Show InChI InChI=1S/C6H10N4O6S/c1-5-8-4-6(10(11)12)9(5)2-3-15-17(13,14)16-7/h4H,2-3,7H2,1H3
Reactome pathway
US Patent
33.8n/an/an/an/an/an/a7.5n/a
Stichting Maastricht Radiation Oncology “Maastro-Clinic”; Université Montpellier 2 Sciences et Techniques
US Patent
Assay Description
The inhibition constants (K) the compounds for four CA isozymes, CA I, II, IX and XII were determined. An Applied Photophysics (Oxford, UK) stopped-f...
US Patent US8980932 (2015)
BindingDB Entry DOI: 10.7270/Q2GX499J
Carbonic anhydrase 1
(Homo sapiens (Human))
BDBM150247
(US8980932, 9 (DH338))
Show SMILES Cc1ncc(n1CCOS(=O)(=O)ON)[N+]([O-])=O
Show InChI InChI=1S/C6H10N4O6S/c1-5-8-4-6(10(11)12)9(5)2-3-15-17(13,14)16-7/h4H,2-3,7H2,1H3
NCI pathway
Reactome pathway
US Patent
4.44E+3n/an/an/an/an/an/a7.5n/a
Stichting Maastricht Radiation Oncology “Maastro-Clinic”; Université Montpellier 2 Sciences et Techniques
US Patent
Assay Description
The inhibition constants (K) the compounds for four CA isozymes, CA I, II, IX and XII were determined. An Applied Photophysics (Oxford, UK) stopped-f...
US Patent US8980932 (2015)
BindingDB Entry DOI: 10.7270/Q2GX499J