BDBM150813 US8981106, 3
SMILES: OB(O)c1ccc(F)cc1CSc1ccc(cn1)C(=O)Nc1ccc(F)cc1
InChI Key: InChIKey=DLHXKIOUORFOQU-UHFFFAOYSA-N
Data: 1 IC50
Activity Spreadsheet -- Enzyme Inhibition Constant Data from BindingDB
Found 1 hit for monomerid = 150813
Trg + Lig
Ki
nM
ΔG°
kcal/mole
IC50
nM
Kd
nM
EC50/IC50
nM
koff
s-1
kon
M-1s-1
pHTemp
°C
C-X-C chemokine receptor type 2
(Homo sapiens (Human))
BDBM150813
(US8981106, 3)
Show SMILES OB(O)c1ccc(F)cc1CSc1ccc(cn1)C(=O)Nc1ccc(F)cc1
Show InChI InChI=1S/C19H15BF2N2O3S/c21-14-2-5-16(6-3-14)24-19(25)12-1-8-18(23-10-12)28-11-13-9-15(22)4-7-17(13)20(26)27/h1-10,26-27H,11H2,(H,24,25)
Reactome pathway
US Patent
n/an/a 52n/an/an/an/an/a37
Syntrix Biosystems, Inc.
US Patent
Assay Description
An in vitro assay showed inhibition of CXCR2-mediated intracellular calcium release. Briefly, human neutrophils were suspended in HBSS- (without Ca2+...
US Patent US8981106 (2015)
BindingDB Entry DOI: 10.7270/Q2WW7GC1