BDBM150838 US8981106, 27
SMILES: Fc1ccc(NC(=O)c2ccc(SCc3ccc(Cl)c(Cl)c3)nc2)cc1
InChI Key: InChIKey=KQSOSKKYANTPHD-UHFFFAOYSA-N
Data: 2 IC50
Activity Spreadsheet -- Enzyme Inhibition Constant Data from BindingDB
Found 2 hits for monomerid = 150838
Trg + Lig
Ki
nM
ΔG°
kcal/mole
IC50
nM
Kd
nM
EC50/IC50
nM
koff
s-1
kon
M-1s-1
pHTemp
°C
C-X-C chemokine receptor type 2
(Homo sapiens (Human))
BDBM150838
(US8981106, 27)
Show SMILES Fc1ccc(NC(=O)c2ccc(SCc3ccc(Cl)c(Cl)c3)nc2)cc1
Show InChI InChI=1S/C19H13Cl2FN2OS/c20-16-7-1-12(9-17(16)21)11-26-18-8-2-13(10-23-18)19(25)24-15-5-3-14(22)4-6-15/h1-10H,11H2,(H,24,25)
Reactome pathway
n/an/a 1.61E+3n/an/an/an/an/an/a
Syntrix Biosystems
Curated by ChEMBL
Assay Description
Antagonist activity at CXCR2 in human PMNs assessed as inhibition of CXCL1-induced intracellular Ca2+ release by fluorescence based calcium flux assa...
J Med Chem 57: 8378-97 (2014)
Article DOI: 10.1021/jm500827t
BindingDB Entry DOI: 10.7270/Q2FX7C22
C-X-C chemokine receptor type 2
(Homo sapiens (Human))
BDBM150838
(US8981106, 27)
Show SMILES Fc1ccc(NC(=O)c2ccc(SCc3ccc(Cl)c(Cl)c3)nc2)cc1
Show InChI InChI=1S/C19H13Cl2FN2OS/c20-16-7-1-12(9-17(16)21)11-26-18-8-2-13(10-23-18)19(25)24-15-5-3-14(22)4-6-15/h1-10H,11H2,(H,24,25)
Reactome pathway
US Patent
n/an/a 1.61E+3n/an/an/an/an/a37
Syntrix Biosystems, Inc.
US Patent
Assay Description
An in vitro assay showed inhibition of CXCR2-mediated intracellular calcium release. Briefly, human neutrophils were suspended in HBSS- (without Ca2+...
US Patent US8981106 (2015)
BindingDB Entry DOI: 10.7270/Q2WW7GC1