BDBM151297 US8987314, B93
SMILES: COCCNC(=O)c1ccc(cc1)-c1ccc2sc(nc2c1)C(C(=O)NCCS(N)(=O)=O)S(C)(=O)=O
InChI Key: InChIKey=QQNWEDCUQKBQKQ-UHFFFAOYSA-N
Data: 2 IC50
Activity Spreadsheet -- Enzyme Inhibition Constant Data from BindingDB
Found 2 hits for monomerid = 151297
Trg + Lig
Ki
nM
ΔG°
kcal/mole
IC50
nM
Kd
nM
EC50/IC50
nM
koff
s-1
kon
M-1s-1
pHTemp
°C
Hepatic Lipase (HL)
(Homo sapiens (Human))
BDBM151297
(US8987314, B93)
Show SMILES COCCNC(=O)c1ccc(cc1)-c1ccc2sc(nc2c1)C(C(=O)NCCS(N)(=O)=O)S(C)(=O)=O
Show InChI InChI=1S/C22H26N4O7S3/c1-33-11-9-24-20(27)15-5-3-14(4-6-15)16-7-8-18-17(13-16)26-22(34-18)19(35(2,29)30)21(28)25-10-12-36(23,31)32/h3-8,13,19H,9-12H2,1-2H3,(H,24,27)(H,25,28)(H2,23,31,32)
US Patent
n/an/a 7.10n/an/an/an/a8.025
Bristol-Myers Squibb Company
US Patent
Assay Description
Endothelial lipase (EL) and hepatic lipase (HL) activities were measured using a fluorescent substrate, A10070, (Invitrogen, CA) doped into an artifi...
US Patent US8987314 (2015)
BindingDB Entry DOI: 10.7270/Q2W094N8
Endothelial lipase
(Homo sapiens (Human))
BDBM151297
(US8987314, B93)
Show SMILES COCCNC(=O)c1ccc(cc1)-c1ccc2sc(nc2c1)C(C(=O)NCCS(N)(=O)=O)S(C)(=O)=O
Show InChI InChI=1S/C22H26N4O7S3/c1-33-11-9-24-20(27)15-5-3-14(4-6-15)16-7-8-18-17(13-16)26-22(34-18)19(35(2,29)30)21(28)25-10-12-36(23,31)32/h3-8,13,19H,9-12H2,1-2H3,(H,24,27)(H,25,28)(H2,23,31,32)
US Patent
n/an/a 0.5n/an/an/an/a8.025
Bristol-Myers Squibb Company
US Patent
Assay Description
Endothelial lipase (EL) and hepatic lipase (HL) activities were measured using a fluorescent substrate, A10070, (Invitrogen, CA) doped into an artifi...
US Patent US8987314 (2015)
BindingDB Entry DOI: 10.7270/Q2W094N8