null
SMILES: COc1c(F)cc(cc1F)-c1ccc2nc(sc2c1)C(C(=O)NCCS(N)(=O)=O)S(C)(=O)=O
InChI Key: InChIKey=KMSJUBGFIVYNKV-UHFFFAOYSA-N
Activity Spreadsheet -- Enzyme Inhibition Constant Data from BindingDB
Found 2 hits for monomerid = 151407
Trg + Lig
Ki
nM
ΔG°
kcal/mole
IC50
nM
Kd
nM
EC50/IC50
nM
koff
s-1
kon
M-1s-1
pHTemp
°C
Hepatic triacylglycerol lipase
(Homo sapiens (Human))
BDBM151407
(US8987314, B218)
Show SMILES COc1c(F)cc(cc1F)-c1ccc2nc(sc2c1)C(C(=O)NCCS(N)(=O)=O)S(C)(=O)=O
Show InChI InChI=1S/C19H19F2N3O6S3/c1-30-16-12(20)7-11(8-13(16)21)10-3-4-14-15(9-10)31-19(24-14)17(32(2,26)27)18(25)23-5-6-33(22,28)29/h3-4,7-9,17H,5-6H2,1-2H3,(H,23,25)(H2,22,28,29)
US Patent
n/an/a 5.20n/an/an/an/a8.025
Bristol-Myers Squibb Company
US Patent
Assay Description
Endothelial lipase (EL) and hepatic lipase (HL) activities were measured using a fluorescent substrate, A10070, (Invitrogen, CA) doped into an artifi...
US Patent US8987314 (2015)
BindingDB Entry DOI: 10.7270/Q2W094N8
Endothelial lipase
(Homo sapiens (Human))
BDBM151407
(US8987314, B218)
Show SMILES COc1c(F)cc(cc1F)-c1ccc2nc(sc2c1)C(C(=O)NCCS(N)(=O)=O)S(C)(=O)=O
Show InChI InChI=1S/C19H19F2N3O6S3/c1-30-16-12(20)7-11(8-13(16)21)10-3-4-14-15(9-10)31-19(24-14)17(32(2,26)27)18(25)23-5-6-33(22,28)29/h3-4,7-9,17H,5-6H2,1-2H3,(H,23,25)(H2,22,28,29)
US Patent
n/an/a 1.70n/an/an/an/a8.025
Bristol-Myers Squibb Company
US Patent
Assay Description
Endothelial lipase (EL) and hepatic lipase (HL) activities were measured using a fluorescent substrate, A10070, (Invitrogen, CA) doped into an artifi...
US Patent US8987314 (2015)
BindingDB Entry DOI: 10.7270/Q2W094N8