BDBM151415 US8987314, B226
SMILES: NS(=O)(=O)CCNC(=O)C(c1nc2ccc(cc2s1)-c1ccc(cc1)C(=O)NC1CC1)S(=O)(=O)Cc1ccc(OC(F)(F)F)cc1
InChI Key: InChIKey=IXVVFVOSTGPFPV-UHFFFAOYSA-N
Data: 2 IC50
Activity Spreadsheet -- Enzyme Inhibition Constant Data from BindingDB
Found 2 hits for monomerid = 151415
Trg + Lig
Ki
nM
ΔG°
kcal/mole
IC50
nM
Kd
nM
EC50/IC50
nM
koff
s-1
kon
M-1s-1
pHTemp
°C
Hepatic Lipase (HL)
(Homo sapiens (Human))
BDBM151415
(US8987314, B226)
Show SMILES NS(=O)(=O)CCNC(=O)C(c1nc2ccc(cc2s1)-c1ccc(cc1)C(=O)NC1CC1)S(=O)(=O)Cc1ccc(OC(F)(F)F)cc1
Show InChI InChI=1S/C29H27F3N4O7S3/c30-29(31,32)43-22-10-1-17(2-11-22)16-45(39,40)25(27(38)34-13-14-46(33,41)42)28-36-23-12-7-20(15-24(23)44-28)18-3-5-19(6-4-18)26(37)35-21-8-9-21/h1-7,10-12,15,21,25H,8-9,13-14,16H2,(H,34,38)(H,35,37)(H2,33,41,42)
US Patent
n/an/a 74n/an/an/an/a8.025
Bristol-Myers Squibb Company
US Patent
Assay Description
Endothelial lipase (EL) and hepatic lipase (HL) activities were measured using a fluorescent substrate, A10070, (Invitrogen, CA) doped into an artifi...
US Patent US8987314 (2015)
BindingDB Entry DOI: 10.7270/Q2W094N8
Endothelial lipase
(Homo sapiens (Human))
BDBM151415
(US8987314, B226)
Show SMILES NS(=O)(=O)CCNC(=O)C(c1nc2ccc(cc2s1)-c1ccc(cc1)C(=O)NC1CC1)S(=O)(=O)Cc1ccc(OC(F)(F)F)cc1
Show InChI InChI=1S/C29H27F3N4O7S3/c30-29(31,32)43-22-10-1-17(2-11-22)16-45(39,40)25(27(38)34-13-14-46(33,41)42)28-36-23-12-7-20(15-24(23)44-28)18-3-5-19(6-4-18)26(37)35-21-8-9-21/h1-7,10-12,15,21,25H,8-9,13-14,16H2,(H,34,38)(H,35,37)(H2,33,41,42)
US Patent
n/an/a 0.5n/an/an/an/a8.025
Bristol-Myers Squibb Company
US Patent
Assay Description
Endothelial lipase (EL) and hepatic lipase (HL) activities were measured using a fluorescent substrate, A10070, (Invitrogen, CA) doped into an artifi...
US Patent US8987314 (2015)
BindingDB Entry DOI: 10.7270/Q2W094N8