BDBM151433 US8987314, B244
SMILES: COC(C)(C)CNC(=O)c1ccc(cc1)-c1ccc2nc(sc2c1)C(C(=O)NCCS(N)(=O)=O)S(=O)(=O)CC1CC1
InChI Key: InChIKey=QUCFZGMALXUQTD-UHFFFAOYSA-N
Data: 2 IC50
Activity Spreadsheet -- Enzyme Inhibition Constant Data from BindingDB
Found 2 hits for monomerid = 151433
Trg + Lig
Ki
nM
ΔG°
kcal/mole
IC50
nM
Kd
nM
EC50/IC50
nM
koff
s-1
kon
M-1s-1
pHTemp
°C
Hepatic Lipase (HL)
(Homo sapiens (Human))
BDBM151433
(US8987314, B244)
Show SMILES COC(C)(C)CNC(=O)c1ccc(cc1)-c1ccc2nc(sc2c1)C(C(=O)NCCS(N)(=O)=O)S(=O)(=O)CC1CC1
Show InChI InChI=1S/C27H34N4O7S3/c1-27(2,38-3)16-30-24(32)19-8-6-18(7-9-19)20-10-11-21-22(14-20)39-26(31-21)23(40(34,35)15-17-4-5-17)25(33)29-12-13-41(28,36)37/h6-11,14,17,23H,4-5,12-13,15-16H2,1-3H3,(H,29,33)(H,30,32)(H2,28,36,37)
US Patent
n/an/a 12n/an/an/an/a8.025
Bristol-Myers Squibb Company
US Patent
Assay Description
Endothelial lipase (EL) and hepatic lipase (HL) activities were measured using a fluorescent substrate, A10070, (Invitrogen, CA) doped into an artifi...
US Patent US8987314 (2015)
BindingDB Entry DOI: 10.7270/Q2W094N8
Endothelial lipase
(Homo sapiens (Human))
BDBM151433
(US8987314, B244)
Show SMILES COC(C)(C)CNC(=O)c1ccc(cc1)-c1ccc2nc(sc2c1)C(C(=O)NCCS(N)(=O)=O)S(=O)(=O)CC1CC1
Show InChI InChI=1S/C27H34N4O7S3/c1-27(2,38-3)16-30-24(32)19-8-6-18(7-9-19)20-10-11-21-22(14-20)39-26(31-21)23(40(34,35)15-17-4-5-17)25(33)29-12-13-41(28,36)37/h6-11,14,17,23H,4-5,12-13,15-16H2,1-3H3,(H,29,33)(H,30,32)(H2,28,36,37)
US Patent
n/an/a 0.900n/an/an/an/a8.025
Bristol-Myers Squibb Company
US Patent
Assay Description
Endothelial lipase (EL) and hepatic lipase (HL) activities were measured using a fluorescent substrate, A10070, (Invitrogen, CA) doped into an artifi...
US Patent US8987314 (2015)
BindingDB Entry DOI: 10.7270/Q2W094N8