BDBM15145 5-indazolyl pyridine 16::N-[(2S)-2-amino-3-phenylpropyl]-5-(3-methyl-1H-indazol-5-yl)pyridin-3-amine
SMILES: Cc1n[nH]c2ccc(cc12)-c1cncc(NC[C@@H](N)Cc2ccccc2)c1
InChI Key: InChIKey=AIGXEZVGFUERRR-IBGZPJMESA-N
Data: 1 KI
Activity Spreadsheet -- Enzyme Inhibition Constant Data from BindingDB
Found 1 hit for monomerid = 15145
Trg + Lig
Ki
nM
ΔG°
kcal/mole
IC50
nM
Kd
nM
EC50/IC50
nM
koff
s-1
kon
M-1s-1
pHTemp
°C
RAC-alpha serine/threonine-protein kinase [139-480,S378A,S381A,T450D,S473D]
(Homo sapiens (Human))
BDBM15145
(5-indazolyl pyridine 16 | N-[(2S)-2-amino-3-phenyl...)
Show SMILES Cc1n[nH]c2ccc(cc12)-c1cncc(NC[C@@H](N)Cc2ccccc2)c1 |r|
Show InChI InChI=1S/C22H23N5/c1-15-21-11-17(7-8-22(21)27-26-15)18-10-20(14-24-12-18)25-13-19(23)9-16-5-3-2-4-6-16/h2-8,10-12,14,19,25H,9,13,23H2,1H3,(H,26,27)/t19-/m0/s1
8.30 -10.9n/an/an/an/an/a7.522
Abbott Laboratories
Assay Description
The kinase assay uses His-Akt1 and a biotinylated peptide as substrate. The biotinylated peptides were immobilized on streptavidin-coated FLASH plat...
Bioorg Med Chem Lett 16: 3740-4 (2006)
Article DOI: 10.1016/j.bmcl.2006.04.046
BindingDB Entry DOI: 10.7270/Q2ZP44C9