BDBM15147 5-indazolyl pyridine 24::5-{5-[(2R)-2-amino-3-phenylpropoxy]pyridin-3-yl}-3-methyl-1H-indazole
SMILES: Cc1n[nH]c2ccc(cc12)-c1cncc(OC[C@H](N)Cc2ccccc2)c1
InChI Key: InChIKey=BPNUQXPIQBZCMR-LJQANCHMSA-N
Data: 1 KI
PDB links: 3 PDB IDs contain this monomer as substructures. 3 PDB IDs contain inhibitors having a similarity of 90% to this monomer.
Activity Spreadsheet -- Enzyme Inhibition Constant Data from BindingDB
Found 1 hit for monomerid = 15147
Trg + Lig
Ki
nM
ΔG°
kcal/mole
IC50
nM
Kd
nM
EC50/IC50
nM
koff
s-1
kon
M-1s-1
pHTemp
°C
Protein kinase B (Akt 1)
(Homo sapiens (Human))
BDBM15147
(5-indazolyl pyridine 24 | 5-{5-[(2R)-2-amino-3-phe...)
Show SMILES Cc1n[nH]c2ccc(cc12)-c1cncc(OC[C@H](N)Cc2ccccc2)c1 |r|
Show InChI InChI=1S/C22H22N4O/c1-15-21-11-17(7-8-22(21)26-25-15)18-10-20(13-24-12-18)27-14-19(23)9-16-5-3-2-4-6-16/h2-8,10-13,19H,9,14,23H2,1H3,(H,25,26)/t19-/m1/s1
626 -8.37n/an/an/an/an/a7.522
Abbott Laboratories
Assay Description
The kinase assay uses His-Akt1 and a biotinylated peptide as substrate. The biotinylated peptides were immobilized on streptavidin-coated FLASH plat...
Bioorg Med Chem Lett 16: 3740-4 (2006)
Article DOI: 10.1016/j.bmcl.2006.04.046
BindingDB Entry DOI: 10.7270/Q2ZP44C9