null
SMILES: Nc1nccc(n1)-c1c(ncn1CC1CC1)-c1ccc(F)cc1
InChI Key: InChIKey=DFEYXQGDDCDXJK-UHFFFAOYSA-N
PDB links: 1 PDB ID matches this monomer. 1 PDB ID contains inhibitors having a similarity of 90% to this monomer.
Activity Spreadsheet -- Enzyme Inhibition Constant Data from BindingDB
Found 3 hits for monomerid = 15238
Trg + Lig
Ki
nM
ΔG°
kcal/mole
IC50
nM
Kd
nM
EC50/IC50
nM
koff
s-1
kon
M-1s-1
pHTemp
°C
Mitogen-activated protein kinase 14
(Homo sapiens (Human))
BDBM15238
(4-[1-(cyclopropylmethyl)-4-(4-fluorophenyl)-1H-imi...)
Show SMILES Nc1nccc(n1)-c1c(ncn1CC1CC1)-c1ccc(F)cc1
Show InChI InChI=1S/C17H16FN5/c18-13-5-3-12(4-6-13)15-16(14-7-8-20-17(19)22-14)23(10-21-15)9-11-1-2-11/h3-8,10-11H,1-2,9H2,(H2,19,20,22)
NCI pathway
Reactome pathway
n/an/a 25n/an/an/an/a7.537
University of Texas Southwestern Medical Center at Dallas
Assay Description
Kinase activity was assayed in reaction buffer containing substrate, enzyme, and inhibitor in the presence of 0.17 mM ATP/[gamma-32P] ATP. 32P incorp...
Structure 6: 1117-28 (1998)
Article DOI: 10.1016/s0969-2126(98)00113-0
BindingDB Entry DOI: 10.7270/Q2XP7351
Mitogen-activated protein kinase 14
(Homo sapiens (Human))
BDBM15238
(4-[1-(cyclopropylmethyl)-4-(4-fluorophenyl)-1H-imi...)
Show SMILES Nc1nccc(n1)-c1c(ncn1CC1CC1)-c1ccc(F)cc1
Show InChI InChI=1S/C17H16FN5/c18-13-5-3-12(4-6-13)15-16(14-7-8-20-17(19)22-14)23(10-21-15)9-11-1-2-11/h3-8,10-11H,1-2,9H2,(H2,19,20,22)
NCI pathway
Reactome pathway
n/an/a 25n/an/an/an/an/an/a
King's College London
Curated by ChEMBL
Assay Description
Inhibition of human MAPK p38alpha
Bioorg Med Chem 18: 2204-18 (2010)
Article DOI: 10.1016/j.bmc.2010.01.070
BindingDB Entry DOI: 10.7270/Q27945MJ
Mitogen-activated protein kinase 1
(Rattus norvegicus (rat))
BDBM15238
(4-[1-(cyclopropylmethyl)-4-(4-fluorophenyl)-1H-imi...)
Show SMILES Nc1nccc(n1)-c1c(ncn1CC1CC1)-c1ccc(F)cc1
Show InChI InChI=1S/C17H16FN5/c18-13-5-3-12(4-6-13)15-16(14-7-8-20-17(19)22-14)23(10-21-15)9-11-1-2-11/h3-8,10-11H,1-2,9H2,(H2,19,20,22)
Reactome pathway
n/an/a>1.00E+5n/an/an/an/a7.537
University of Texas Southwestern Medical Center at Dallas
Assay Description
Kinase activity was assayed in reaction buffer containing substrate, enzyme, and inhibitor in the presence of 0.17 mM ATP/[gamma-32P] ATP. 32P incorp...
Structure 6: 1117-28 (1998)
Article DOI: 10.1016/s0969-2126(98)00113-0
BindingDB Entry DOI: 10.7270/Q2XP7351
3D
3D Structure (docked)