BDBM152499 (E)-N'-(2-oxoindolin-3-ylidene)dodecanehydrazide (20)
SMILES: CCCCCCCCCCCC(=O)N\N=C1\C(=O)Nc2ccccc12
InChI Key: InChIKey=FOOCWPXPGHFFPM-UHFFFAOYSA-N
Data: 1 IC50
Activity Spreadsheet -- Enzyme Inhibition Constant Data from BindingDB
Found 1 hit for monomerid = 152499
Trg + Lig
Ki
nM
ΔG°
kcal/mole
IC50
nM
Kd
nM
EC50/IC50
nM
koff
s-1
kon
M-1s-1
pHTemp
°C
Alpha-glucosidase MAL12
(Saccharomyces cerevisiae)
BDBM152499
((E)-N'-(2-oxoindolin-3-ylidene)dodecanehydrazi...)
Show SMILES CCCCCCCCCCCC(=O)N\N=C1\C(=O)Nc2ccccc12
Show InChI InChI=1S/C20H29N3O2/c1-2-3-4-5-6-7-8-9-10-15-18(24)22-23-19-16-13-11-12-14-17(16)21-20(19)25/h11-14H,2-10,15H2,1H3,(H,22,24)(H,21,23,25)
Reactome pathway
n/an/a 3.00E+3n/an/an/an/an/an/a
Hazara University
Assay Description
10 µL of test samples (5 mg/mL DMSO solution) were reconstituted in 100 µL of 100 mM-phosphate buffer (pH6.8) in 96-well microplate and incubated wit...
Bioorg Chem 60: 42-8 (2015)
Article DOI: 10.1016/j.bioorg.2015.03.005
BindingDB Entry DOI: 10.7270/Q2DR2T7R