BDBM1525 2-ethyl-5-ethynyl-9-methyl-2,4,9,15-tetraazatricyclo[9.4.0.0^{3,8}]pentadeca-1(11),3,5,7,12,14-hexaen-10-one::Dipyridodiazepinone deriv. 12
SMILES: CCN1c2nc(ccc2N(C)C(=O)c2cccnc12)C#C
InChI Key: InChIKey=NUPNETPGMWUZFL-UHFFFAOYSA-N
Data: 2 IC50
Activity Spreadsheet -- Enzyme Inhibition Constant Data from BindingDB
Found 2 hits for monomerid = 1525
Trg + Lig
Ki
nM
ΔG°
kcal/mole
IC50
nM
Kd
nM
EC50/IC50
nM
koff
s-1
kon
M-1s-1
pHTemp
°C
HIV-1 Reverse Transcriptase Mutant (Y181C)
(Human immunodeficiency virus type 1)
BDBM1525
(2-ethyl-5-ethynyl-9-methyl-2,4,9,15-tetraazatricyc...)
Show SMILES CCN1c2nc(ccc2N(C)C(=O)c2cccnc12)C#C
Show InChI InChI=1S/C16H14N4O/c1-4-11-8-9-13-15(18-11)20(5-2)14-12(7-6-10-17-14)16(21)19(13)3/h1,6-10H,5H2,2-3H3
n/an/a 420n/an/an/an/a7.825
Boehringer Ingelheim Pharmaceuticals Inc.
Assay Description
The IC50 of reverse transcriptase is the concentration that inhibits 50% of recombinant HIV-1 RT RNA-directed DNA polymerase activity in vitro.
J Med Chem 38: 4830-8 (1995)
Article DOI: 10.1021/jm00024a010
BindingDB Entry DOI: 10.7270/Q23B5XBJ
HIV-1 Reverse Transcriptase
(Human immunodeficiency virus type 1)
BDBM1525
(2-ethyl-5-ethynyl-9-methyl-2,4,9,15-tetraazatricyc...)
Show SMILES CCN1c2nc(ccc2N(C)C(=O)c2cccnc12)C#C
Show InChI InChI=1S/C16H14N4O/c1-4-11-8-9-13-15(18-11)20(5-2)14-12(7-6-10-17-14)16(21)19(13)3/h1,6-10H,5H2,2-3H3
n/an/a 140n/an/an/an/a7.825
Boehringer Ingelheim Pharmaceuticals Inc.
Assay Description
The IC50 of reverse transcriptase is the concentration that inhibits 50% of recombinant HIV-1 RT RNA-directed DNA polymerase activity in vitro.
J Med Chem 38: 4830-8 (1995)
Article DOI: 10.1021/jm00024a010
BindingDB Entry DOI: 10.7270/Q23B5XBJ