BDBM152503 (4-Bromo-2,5-dimethoxyphenyl)(4-methoxyphenyl)methanone (15)
SMILES: COc1ccc(cc1)C(=O)c1cc(OC)c(Br)cc1OC
InChI Key: InChIKey=BMJUZHUOQIOZNL-UHFFFAOYSA-N
Data: 1 KI  1 IC50
Activity Spreadsheet -- Enzyme Inhibition Constant Data from BindingDB
Found 1 hit for monomerid = 152503
Trg + Lig
Ki
nM
ΔG°
kcal/mole
IC50
nM
Kd
nM
EC50/IC50
nM
koff
s-1
kon
M-1s-1
pHTemp
°C
Acetylcholinesterase
(Homo sapiens (Human))
BDBM152503
((4-Bromo-2,5-dimethoxyphenyl)(4-methoxyphenyl)meth...)
Show SMILES COc1ccc(cc1)C(=O)c1cc(OC)c(Br)cc1OC
Show InChI InChI=1S/C16H15BrO4/c1-19-11-6-4-10(5-7-11)16(18)12-8-15(21-3)13(17)9-14(12)20-2/h4-9H,1-3H3
NCI pathway
Reactome pathway
3.77n/a 4.22n/an/an/an/a8.0n/a
Ataturk University
Assay Description
AChI and 5,5'-dithio-bis(2-nitro-benzoic)acid (DTNB) were used as substrate for this enzymatic reaction. To this end, 100 µL of Tris/HCl buffer (...
Bioorg Chem 60: 49-57 (2015)
Article DOI: 10.1016/j.bioorg.2015.04.006
BindingDB Entry DOI: 10.7270/Q2930RW6