null
SMILES: [O-][N+](=O)c1ccc(NC(=S)Nc2ccc(cc2)C(c2c[nH]c3ccc(Br)cc23)c2c[nH]c3ccc(Br)cc23)cc1
InChI Key: InChIKey=XLHMGYUTDDMTMI-UHFFFAOYSA-N
Activity Spreadsheet -- Enzyme Inhibition Constant Data from BindingDB
Found 1 hit for monomerid = 152668
Trg + Lig
Ki
nM
ΔG°
kcal/mole
IC50
nM
Kd
nM
EC50/IC50
nM
koff
s-1
kon
M-1s-1
pHTemp
°C
Carbonic anhydrase 2
(Bos taurus)
BDBM152668
Show SMILES [O-][N+](=O)c1ccc(NC(=S)Nc2ccc(cc2)C(c2c[nH]c3ccc(Br)cc23)c2c[nH]c3ccc(Br)cc23)cc1
Show InChI InChI=1S/C30H21Br2N5O2S/c31-18-3-11-27-23(13-18)25(15-33-27)29(26-16-34-28-12-4-19(32)14-24(26)28)17-1-5-20(6-2-17)35-30(40)36-21-7-9-22(10-8-21)37(38)39/h1-16,29,33-34H,(H2,35,36,40)
n/an/a 3.23E+4n/an/an/an/a7.2n/a
Universiti Teknologi MARA (UiTM)
Assay Description
This was assay performed using buffer containing Tris and HEPES at the pH of 7.2-7.9 and a total concentration of 20 mM. 96-well plates were filled w...
Bioorg Chem 62: 83-93 (2015)
Article DOI: 10.1016/j.bioorg.2015.08.001
BindingDB Entry DOI: 10.7270/Q2R2103V