BDBM153162 US8993756, 4-4
SMILES: CCOC(=O)c1c[nH]c2ncnc(-c3cc(NC(=O)C(C)=C)nc(OC)c3)c12
InChI Key: InChIKey=NOGRIHHHCMNXTE-UHFFFAOYSA-N
Data: 2 IC50
Activity Spreadsheet -- Enzyme Inhibition Constant Data from BindingDB
Found 2 hits for monomerid = 153162
Trg + Lig
Ki
nM
ΔG°
kcal/mole
IC50
nM
Kd
nM
EC50/IC50
nM
koff
s-1
kon
M-1s-1
pHTemp
°C
Tyrosine-protein kinase JAK2
(Homo sapiens (Human))
BDBM153162
(US8993756, 4-4)
Show SMILES CCOC(=O)c1c[nH]c2ncnc(-c3cc(NC(=O)C(C)=C)nc(OC)c3)c12
Show InChI InChI=1S/C19H19N5O4/c1-5-28-19(26)12-8-20-17-15(12)16(21-9-22-17)11-6-13(23-14(7-11)27-4)24-18(25)10(2)3/h6-9H,2,5H2,1,3-4H3,(H,20,21,22)(H,23,24,25)
Reactome pathway
US Patent
n/an/a>1.50E+3n/an/an/an/an/a25
Merck Sharp & Dohme Corp.
US Patent
Assay Description
The ability of compounds to inhibit the activity of JAKl, JAK2, JAK3, and Tyk2 was measured using a recombinant purified GST-tagged catalytic domain ...
US Patent US8993756 (2015)
BindingDB Entry DOI: 10.7270/Q2VQ31DJ
Tyrosine-protein kinase JAK3
(Homo sapiens (Human))
BDBM153162
(US8993756, 4-4)
Show SMILES CCOC(=O)c1c[nH]c2ncnc(-c3cc(NC(=O)C(C)=C)nc(OC)c3)c12
Show InChI InChI=1S/C19H19N5O4/c1-5-28-19(26)12-8-20-17-15(12)16(21-9-22-17)11-6-13(23-14(7-11)27-4)24-18(25)10(2)3/h6-9H,2,5H2,1,3-4H3,(H,20,21,22)(H,23,24,25)
Reactome pathway
US Patent
n/an/a 0.0490n/an/an/an/an/a25
Merck Sharp & Dohme Corp.
US Patent
Assay Description
The ability of compounds to inhibit the activity of JAKl, JAK2, JAK3, and Tyk2 was measured using a recombinant purified GST-tagged catalytic domain ...
US Patent US8993756 (2015)
BindingDB Entry DOI: 10.7270/Q2VQ31DJ