BDBM153170 US8993756, 4-14
SMILES: CCOC(=O)c1c[nH]c2ncnc(-c3ccc(Cl)c(NC(=O)C=C)c3)c12
InChI Key: InChIKey=VARYBRIEQWFKQW-UHFFFAOYSA-N
Data: 2 IC50
Activity Spreadsheet -- Enzyme Inhibition Constant Data from BindingDB
Found 2 hits for monomerid = 153170
Trg + Lig
Ki
nM
ΔG°
kcal/mole
IC50
nM
Kd
nM
EC50/IC50
nM
koff
s-1
kon
M-1s-1
pHTemp
°C
Tyrosine-protein kinase JAK2
(Homo sapiens (Human))
BDBM153170
(US8993756, 4-14)
Show SMILES CCOC(=O)c1c[nH]c2ncnc(-c3ccc(Cl)c(NC(=O)C=C)c3)c12
Show InChI InChI=1S/C18H15ClN4O3/c1-3-14(24)23-13-7-10(5-6-12(13)19)16-15-11(18(25)26-4-2)8-20-17(15)22-9-21-16/h3,5-9H,1,4H2,2H3,(H,23,24)(H,20,21,22)
Reactome pathway
US Patent
n/an/a>1.50E+3n/an/an/an/an/a25
Merck Sharp & Dohme Corp.
US Patent
Assay Description
The ability of compounds to inhibit the activity of JAKl, JAK2, JAK3, and Tyk2 was measured using a recombinant purified GST-tagged catalytic domain ...
US Patent US8993756 (2015)
BindingDB Entry DOI: 10.7270/Q2VQ31DJ
Tyrosine-protein kinase JAK3
(Homo sapiens (Human))
BDBM153170
(US8993756, 4-14)
Show SMILES CCOC(=O)c1c[nH]c2ncnc(-c3ccc(Cl)c(NC(=O)C=C)c3)c12
Show InChI InChI=1S/C18H15ClN4O3/c1-3-14(24)23-13-7-10(5-6-12(13)19)16-15-11(18(25)26-4-2)8-20-17(15)22-9-21-16/h3,5-9H,1,4H2,2H3,(H,23,24)(H,20,21,22)
Reactome pathway
US Patent
n/an/a 0.0660n/an/an/an/an/a25
Merck Sharp & Dohme Corp.
US Patent
Assay Description
The ability of compounds to inhibit the activity of JAKl, JAK2, JAK3, and Tyk2 was measured using a recombinant purified GST-tagged catalytic domain ...
US Patent US8993756 (2015)
BindingDB Entry DOI: 10.7270/Q2VQ31DJ