BDBM153176 US8993756, 4-20
SMILES: CCOC(=O)c1c[nH]c2ncnc(-c3ccc4CCN(C(=O)C=C)c4c3)c12
InChI Key: InChIKey=LRCIRMQTPNPPBZ-UHFFFAOYSA-N
Data: 2 IC50
Activity Spreadsheet -- Enzyme Inhibition Constant Data from BindingDB
Found 2 hits for monomerid = 153176
Trg + Lig
Ki
nM
ΔG°
kcal/mole
IC50
nM
Kd
nM
EC50/IC50
nM
koff
s-1
kon
M-1s-1
pHTemp
°C
Tyrosine-protein kinase JAK2
(Homo sapiens (Human))
BDBM153176
(US8993756, 4-20)
Show SMILES CCOC(=O)c1c[nH]c2ncnc(-c3ccc4CCN(C(=O)C=C)c4c3)c12
Show InChI InChI=1S/C20H18N4O3/c1-3-16(25)24-8-7-12-5-6-13(9-15(12)24)18-17-14(20(26)27-4-2)10-21-19(17)23-11-22-18/h3,5-6,9-11H,1,4,7-8H2,2H3,(H,21,22,23)
Reactome pathway
US Patent
n/an/a>1.50E+3n/an/an/an/an/a25
Merck Sharp & Dohme Corp.
US Patent
Assay Description
The ability of compounds to inhibit the activity of JAKl, JAK2, JAK3, and Tyk2 was measured using a recombinant purified GST-tagged catalytic domain ...
US Patent US8993756 (2015)
BindingDB Entry DOI: 10.7270/Q2VQ31DJ
Tyrosine-protein kinase JAK3
(Homo sapiens (Human))
BDBM153176
(US8993756, 4-20)
Show SMILES CCOC(=O)c1c[nH]c2ncnc(-c3ccc4CCN(C(=O)C=C)c4c3)c12
Show InChI InChI=1S/C20H18N4O3/c1-3-16(25)24-8-7-12-5-6-13(9-15(12)24)18-17-14(20(26)27-4-2)10-21-19(17)23-11-22-18/h3,5-6,9-11H,1,4,7-8H2,2H3,(H,21,22,23)
Reactome pathway
US Patent
n/an/a 0.0810n/an/an/an/an/a25
Merck Sharp & Dohme Corp.
US Patent
Assay Description
The ability of compounds to inhibit the activity of JAKl, JAK2, JAK3, and Tyk2 was measured using a recombinant purified GST-tagged catalytic domain ...
US Patent US8993756 (2015)
BindingDB Entry DOI: 10.7270/Q2VQ31DJ