BDBM153181 US8993756, 4-26
SMILES: CCOC(=O)c1c[nH]c2ncnc(-c3cc(C)cc(NC(=O)C(C)=C)c3)c12
InChI Key: InChIKey=QKOHGEGQPBNQQC-UHFFFAOYSA-N
Data: 2 IC50
Activity Spreadsheet -- Enzyme Inhibition Constant Data from BindingDB
Found 2 hits for monomerid = 153181
Trg + Lig
Ki
nM
ΔG°
kcal/mole
IC50
nM
Kd
nM
EC50/IC50
nM
koff
s-1
kon
M-1s-1
pHTemp
°C
Tyrosine-protein kinase JAK2
(Homo sapiens (Human))
BDBM153181
(US8993756, 4-26)
Show SMILES CCOC(=O)c1c[nH]c2ncnc(-c3cc(C)cc(NC(=O)C(C)=C)c3)c12
Show InChI InChI=1S/C20H20N4O3/c1-5-27-20(26)15-9-21-18-16(15)17(22-10-23-18)13-6-12(4)7-14(8-13)24-19(25)11(2)3/h6-10H,2,5H2,1,3-4H3,(H,24,25)(H,21,22,23)
Reactome pathway
US Patent
n/an/a>1.50E+3n/an/an/an/an/a25
Merck Sharp & Dohme Corp.
US Patent
Assay Description
The ability of compounds to inhibit the activity of JAKl, JAK2, JAK3, and Tyk2 was measured using a recombinant purified GST-tagged catalytic domain ...
US Patent US8993756 (2015)
BindingDB Entry DOI: 10.7270/Q2VQ31DJ
Tyrosine-protein kinase JAK3
(Homo sapiens (Human))
BDBM153181
(US8993756, 4-26)
Show SMILES CCOC(=O)c1c[nH]c2ncnc(-c3cc(C)cc(NC(=O)C(C)=C)c3)c12
Show InChI InChI=1S/C20H20N4O3/c1-5-27-20(26)15-9-21-18-16(15)17(22-10-23-18)13-6-12(4)7-14(8-13)24-19(25)11(2)3/h6-10H,2,5H2,1,3-4H3,(H,24,25)(H,21,22,23)
Reactome pathway
US Patent
n/an/a 0.190n/an/an/an/an/a25
Merck Sharp & Dohme Corp.
US Patent
Assay Description
The ability of compounds to inhibit the activity of JAKl, JAK2, JAK3, and Tyk2 was measured using a recombinant purified GST-tagged catalytic domain ...
US Patent US8993756 (2015)
BindingDB Entry DOI: 10.7270/Q2VQ31DJ