BDBM153194 US8993756, 5-5
SMILES: CCOC(=O)c1c[nH]c2ncnc(-c3cccc(NC(=O)C(Br)=C)c3)c12
InChI Key: InChIKey=SIVNSCOIWZVSSY-UHFFFAOYSA-N
Data: 2 IC50
Activity Spreadsheet -- Enzyme Inhibition Constant Data from BindingDB
Found 2 hits for monomerid = 153194
Trg + Lig
Ki
nM
ΔG°
kcal/mole
IC50
nM
Kd
nM
EC50/IC50
nM
koff
s-1
kon
M-1s-1
pHTemp
°C
Tyrosine-protein kinase JAK2
(Homo sapiens (Human))
BDBM153194
(US8993756, 5-5)
Show SMILES CCOC(=O)c1c[nH]c2ncnc(-c3cccc(NC(=O)C(Br)=C)c3)c12
Show InChI InChI=1S/C18H15BrN4O3/c1-3-26-18(25)13-8-20-16-14(13)15(21-9-22-16)11-5-4-6-12(7-11)23-17(24)10(2)19/h4-9H,2-3H2,1H3,(H,23,24)(H,20,21,22)
Reactome pathway
US Patent
n/an/a 892n/an/an/an/an/a25
Merck Sharp & Dohme Corp.
US Patent
Assay Description
The ability of compounds to inhibit the activity of JAKl, JAK2, JAK3, and Tyk2 was measured using a recombinant purified GST-tagged catalytic domain ...
US Patent US8993756 (2015)
BindingDB Entry DOI: 10.7270/Q2VQ31DJ
Tyrosine-protein kinase JAK3
(Homo sapiens (Human))
BDBM153194
(US8993756, 5-5)
Show SMILES CCOC(=O)c1c[nH]c2ncnc(-c3cccc(NC(=O)C(Br)=C)c3)c12
Show InChI InChI=1S/C18H15BrN4O3/c1-3-26-18(25)13-8-20-16-14(13)15(21-9-22-16)11-5-4-6-12(7-11)23-17(24)10(2)19/h4-9H,2-3H2,1H3,(H,23,24)(H,20,21,22)
Reactome pathway
US Patent
n/an/a 0.0430n/an/an/an/an/a25
Merck Sharp & Dohme Corp.
US Patent
Assay Description
The ability of compounds to inhibit the activity of JAKl, JAK2, JAK3, and Tyk2 was measured using a recombinant purified GST-tagged catalytic domain ...
US Patent US8993756 (2015)
BindingDB Entry DOI: 10.7270/Q2VQ31DJ