BDBM153213 US8993756, 12-1
SMILES: CCOC(=O)c1c[nH]c2ncnc(-c3cccc(c3)N(C)C(=O)C=C)c12
InChI Key: InChIKey=UQOBGKQNECGMLF-UHFFFAOYSA-N
Data: 2 IC50
Activity Spreadsheet -- Enzyme Inhibition Constant Data from BindingDB
Found 2 hits for monomerid = 153213
Trg + Lig
Ki
nM
ΔG°
kcal/mole
IC50
nM
Kd
nM
EC50/IC50
nM
koff
s-1
kon
M-1s-1
pHTemp
°C
Tyrosine-protein kinase JAK2
(Homo sapiens (Human))
BDBM153213
(US8993756, 12-1)
Show SMILES CCOC(=O)c1c[nH]c2ncnc(-c3cccc(c3)N(C)C(=O)C=C)c12
Show InChI InChI=1S/C19H18N4O3/c1-4-15(24)23(3)13-8-6-7-12(9-13)17-16-14(19(25)26-5-2)10-20-18(16)22-11-21-17/h4,6-11H,1,5H2,2-3H3,(H,20,21,22)
Reactome pathway
US Patent
n/an/a>1.50E+3n/an/an/an/an/a25
Merck Sharp & Dohme Corp.
US Patent
Assay Description
The ability of compounds to inhibit the activity of JAKl, JAK2, JAK3, and Tyk2 was measured using a recombinant purified GST-tagged catalytic domain ...
US Patent US8993756 (2015)
BindingDB Entry DOI: 10.7270/Q2VQ31DJ
Tyrosine-protein kinase JAK3
(Homo sapiens (Human))
BDBM153213
(US8993756, 12-1)
Show SMILES CCOC(=O)c1c[nH]c2ncnc(-c3cccc(c3)N(C)C(=O)C=C)c12
Show InChI InChI=1S/C19H18N4O3/c1-4-15(24)23(3)13-8-6-7-12(9-13)17-16-14(19(25)26-5-2)10-20-18(16)22-11-21-17/h4,6-11H,1,5H2,2-3H3,(H,20,21,22)
Reactome pathway
US Patent
n/an/a 0.130n/an/an/an/an/a25
Merck Sharp & Dohme Corp.
US Patent
Assay Description
The ability of compounds to inhibit the activity of JAKl, JAK2, JAK3, and Tyk2 was measured using a recombinant purified GST-tagged catalytic domain ...
US Patent US8993756 (2015)
BindingDB Entry DOI: 10.7270/Q2VQ31DJ