BDBM153321 BPH-1440
SMILES: CCCCCCCCOc1cccc(c1)C(=O)Nc1ccccc1P(O)(O)=O
InChI Key: InChIKey=JMCMAPWHQMAPQP-UHFFFAOYSA-N
Data: 1 IC50
Activity Spreadsheet -- Enzyme Inhibition Constant Data from BindingDB
Found 1 hit for monomerid = 153321
Trg + Lig
Ki
nM
ΔG°
kcal/mole
IC50
nM
Kd
nM
EC50/IC50
nM
koff
s-1
kon
M-1s-1
pHTemp
°C
Decaprenyl diphosphate synthase
(Mycobacterium tuberculosis H37Rv)
BDBM153321
(BPH-1440)
Show SMILES CCCCCCCCOc1cccc(c1)C(=O)Nc1ccccc1P(O)(O)=O
Show InChI InChI=1S/C21H28NO5P/c1-2-3-4-5-6-9-15-27-18-12-10-11-17(16-18)21(23)22-19-13-7-8-14-20(19)28(24,25)26/h7-8,10-14,16H,2-6,9,15H2,1H3,(H,22,23)(H2,24,25,26)
n/an/a 760n/an/an/an/a7.5n/a
University of California San Diego
Assay Description
We screened an in-house library of 43 compounds using GPP as substrate. Briefly, the condensation of IPP and GPP, FPP, or cis-FPP catalyzed by DPPS w...
Chem Biol Drug Des 85: 756-69 (2015)
Article DOI: 10.1111/cbdd.12463
BindingDB Entry DOI: 10.7270/Q2ZG6QZN