null
SMILES: N[C@@H]1[C@@H](O)[C@H](O)[C@@H](CO)O[C@H]1Oc1cccc(NC(=O)c2ccc(cc2)-c2ccc(cc2)C(=O)Nc2cccc(O[C@@H]3O[C@H](CO)[C@@H](O)[C@H](O)[C@H]3N)c2)c1
InChI Key: InChIKey=CHJQXJRRIDJPPZ-MVXOBQOLSA-N
Activity Spreadsheet -- Enzyme Inhibition Constant Data from BindingDB
Found 1 hit for monomerid = 153369
Trg + Lig
Ki
nM
ΔG°
kcal/mole
IC50
nM
Kd
nM
EC50/IC50
nM
koff
s-1
kon
M-1s-1
pHTemp
°C
Short-chain Z-isoprenyl diphosphate synthase
(Mycobacterium tuberculosis H37Rv)
BDBM153369
(BPH-1425)
Show SMILES N[C@@H]1[C@@H](O)[C@H](O)[C@@H](CO)O[C@H]1Oc1cccc(NC(=O)c2ccc(cc2)-c2ccc(cc2)C(=O)Nc2cccc(O[C@@H]3O[C@H](CO)[C@@H](O)[C@H](O)[C@H]3N)c2)c1 |r|
Show InChI InChI=1S/C38H42N4O12/c39-29-33(47)31(45)27(17-43)53-37(29)51-25-5-1-3-23(15-25)41-35(49)21-11-7-19(8-12-21)20-9-13-22(14-10-20)36(50)42-24-4-2-6-26(16-24)52-38-30(40)34(48)32(46)28(18-44)54-38/h1-16,27-34,37-38,43-48H,17-18,39-40H2,(H,41,49)(H,42,50)/t27-,28-,29-,30-,31-,32-,33-,34-,37-,38-/m1/s1
n/an/a 400n/an/an/an/an/an/a
University of California San Diego
Assay Description
The IC50 values for the most active hits were verified by radiometric assay as follows. A mixture of 15 µM cis-FPP, 100 nM DPPS, and inhibitors in th...
Chem Biol Drug Des 85: 756-69 (2015)
Article DOI: 10.1111/cbdd.12463
BindingDB Entry DOI: 10.7270/Q2ZG6QZN