BDBM153395 6-(3-Aminophenyl)-4-((3-methoxyphenyl)amino)-8-methylquinoline-3-carboxamide (17f)
SMILES: COc1cccc(Nc2c(cnc3c(C)cc(cc23)-c2cccc(N)c2)C(N)=O)c1
InChI Key: InChIKey=ZAQVJEKSUCLNCU-UHFFFAOYSA-N
Data: 1 IC50
Activity Spreadsheet -- Enzyme Inhibition Constant Data from BindingDB
Found 1 hit for monomerid = 153395
Trg + Lig
Ki
nM
ΔG°
kcal/mole
IC50
nM
Kd
nM
EC50/IC50
nM
koff
s-1
kon
M-1s-1
pHTemp
°C
Class I phosphodiesterase B1 (TbrPDEB1)
(Trypanosoma brucei)
BDBM153395
(6-(3-Aminophenyl)-4-((3-methoxyphenyl)amino)-8-met...)
Show SMILES COc1cccc(Nc2c(cnc3c(C)cc(cc23)-c2cccc(N)c2)C(N)=O)c1
Show InChI InChI=1S/C24H22N4O2/c1-14-9-16(15-5-3-6-17(25)10-15)11-20-22(14)27-13-21(24(26)29)23(20)28-18-7-4-8-19(12-18)30-2/h3-13H,25H2,1-2H3,(H2,26,29)(H,27,28)
n/an/a 2.30E+4n/an/an/an/a7.4n/a
Northeastern University
Assay Description
In short, recombinant TbrPDEB1 and TbrPDEB2 were assayed in 10 mM Tris pH 7.4, bovine serum albumin (0.2 mg/mL), 10 mM MgCl2, 25µM cAMP (Enzo Lifesci...
Chem Biol Drug Des 85: 549-64 (2015)
Article DOI: 10.1111/cbdd.12443
BindingDB Entry DOI: 10.7270/Q2FF3R28