BDBM153401 6-(1H-Indol-5-yl)-4-((3-methoxyphenyl)amino)-8-methylquinoline-3-carboxamide (17t)
SMILES: COc1cccc(Nc2c(cnc3c(C)cc(cc23)-c2ccc3[nH]ccc3c2)C(N)=O)c1
InChI Key: InChIKey=PJYZUQWMWGPTIU-UHFFFAOYSA-N
Data: 1 IC50
Activity Spreadsheet -- Enzyme Inhibition Constant Data from BindingDB
Found 1 hit for monomerid = 153401
Trg + Lig
Ki
nM
ΔG°
kcal/mole
IC50
nM
Kd
nM
EC50/IC50
nM
koff
s-1
kon
M-1s-1
pHTemp
°C
Class I phosphodiesterase B1 (TbrPDEB1)
(Trypanosoma brucei)
BDBM153401
(6-(1H-Indol-5-yl)-4-((3-methoxyphenyl)amino)-8-met...)
Show SMILES COc1cccc(Nc2c(cnc3c(C)cc(cc23)-c2ccc3[nH]ccc3c2)C(N)=O)c1
Show InChI InChI=1S/C26H22N4O2/c1-15-10-18(16-6-7-23-17(11-16)8-9-28-23)12-21-24(15)29-14-22(26(27)31)25(21)30-19-4-3-5-20(13-19)32-2/h3-14,28H,1-2H3,(H2,27,31)(H,29,30)
n/an/a 5.90E+3n/an/an/an/a7.4n/a
Northeastern University
Assay Description
In short, recombinant TbrPDEB1 and TbrPDEB2 were assayed in 10 mM Tris pH 7.4, bovine serum albumin (0.2 mg/mL), 10 mM MgCl2, 25µM cAMP (Enzo Lifesci...
Chem Biol Drug Des 85: 549-64 (2015)
Article DOI: 10.1111/cbdd.12443
BindingDB Entry DOI: 10.7270/Q2FF3R28