null
SMILES: Cc1cccc(Nc2c(cnc3c(C)cc(cc23)-c2ccc3cnn(C)c3c2)C(N)=O)c1
InChI Key: InChIKey=DXWCSJVPVLDOPH-UHFFFAOYSA-N
Activity Spreadsheet -- Enzyme Inhibition Constant Data from BindingDB
Found 1 hit for monomerid = 153408
Trg + Lig
Ki
nM
ΔG°
kcal/mole
IC50
nM
Kd
nM
EC50/IC50
nM
koff
s-1
kon
M-1s-1
pHTemp
°C
Phosphodiesterase
(Trypanosoma brucei)
BDBM153408
(8-Methyl-6-(1-methyl-1H-indazol-6-yl)-4-(m-tolylam...)
Show SMILES Cc1cccc(Nc2c(cnc3c(C)cc(cc23)-c2ccc3cnn(C)c3c2)C(N)=O)c1
Show InChI InChI=1S/C26H23N5O/c1-15-5-4-6-20(9-15)30-25-21-11-19(10-16(2)24(21)28-14-22(25)26(27)32)17-7-8-18-13-29-31(3)23(18)12-17/h4-14H,1-3H3,(H2,27,32)(H,28,30)
n/an/a 3.50E+3n/an/an/an/a7.4n/a
Northeastern University
Assay Description
In short, recombinant TbrPDEB1 and TbrPDEB2 were assayed in 10 mM Tris pH 7.4, bovine serum albumin (0.2 mg/mL), 10 mM MgCl2, 25µM cAMP (Enzo Lifesci...
Chem Biol Drug Des 85: 549-64 (2015)
Article DOI: 10.1111/cbdd.12443
BindingDB Entry DOI: 10.7270/Q2FF3R28