BDBM153442 US8993808, 40
SMILES: COc1ccccc1CN[C@H]1CC1c1ccccc1
InChI Key: InChIKey=JYSZLOJJRAJVHI-LYKKTTPLSA-N
Data: 3 IC50
Activity Spreadsheet -- Enzyme Inhibition Constant Data from BindingDB
Found 3 hits for monomerid = 153442
Trg + Lig
Ki
nM
ΔG°
kcal/mole
IC50
nM
Kd
nM
EC50/IC50
nM
koff
s-1
kon
M-1s-1
pHTemp
°C
Amine oxidase (flavin-containing) A
(Homo sapiens (Human))
BDBM153442
(US8993808, 40)
Show SMILES COc1ccccc1CN[C@H]1CC1c1ccccc1 |r|
Show InChI InChI=1S/C17H19NO/c1-19-17-10-6-5-9-14(17)12-18-16-11-15(16)13-7-3-2-4-8-13/h2-10,15-16,18H,11-12H2,1H3/t15?,16-/m0/s1
US Patent
n/an/a 2.78E+4n/an/an/an/a7.5n/a
Oryzon Genomics, S.A.
US Patent
Assay Description
Human recombinant monoamine oxidase proteins MAO-A and MAO-B were purchased from Sigma Aldrich. MAOs catalyze the oxidative deamination of 1, 2 and 3...
US Patent US8993808 (2015)
BindingDB Entry DOI: 10.7270/Q29P30CC
Lysine-specific histone demethylase 1A
(Homo sapiens (Human))
BDBM153442
(US8993808, 40)
Show SMILES COc1ccccc1CN[C@H]1CC1c1ccccc1 |r|
Show InChI InChI=1S/C17H19NO/c1-19-17-10-6-5-9-14(17)12-18-16-11-15(16)13-7-3-2-4-8-13/h2-10,15-16,18H,11-12H2,1H3/t15?,16-/m0/s1
Reactome pathway
US Patent
n/an/a 390n/an/an/an/an/an/a
Oryzon Genomics, S.A.
US Patent
Assay Description
The compounds of the invention can be tested for their ability to inhibit LSD1. The ability of the compounds of the invention to inhibit LSD1 can be ...
US Patent US8993808 (2015)
BindingDB Entry DOI: 10.7270/Q29P30CC
Amine oxidase [flavin-containing] B
(Homo sapiens (Human))
BDBM153442
(US8993808, 40)
Show SMILES COc1ccccc1CN[C@H]1CC1c1ccccc1 |r|
Show InChI InChI=1S/C17H19NO/c1-19-17-10-6-5-9-14(17)12-18-16-11-15(16)13-7-3-2-4-8-13/h2-10,15-16,18H,11-12H2,1H3/t15?,16-/m0/s1
US Patent
n/an/a 1.55E+4n/an/an/an/a7.5n/a
Oryzon Genomics, S.A.
US Patent
Assay Description
Human recombinant monoamine oxidase proteins MAO-A and MAO-B were purchased from Sigma Aldrich. MAOs catalyze the oxidative deamination of 1, 2 and 3...
US Patent US8993808 (2015)
BindingDB Entry DOI: 10.7270/Q29P30CC