BDBM153829 US8999981, A74
SMILES: C[C@H]1CN2CCC[C@H]2CN1C(=O)N1Cc2c(NC(=O)c3nc(Cl)c(Cl)s3)n[nH]c2C1(C)C
InChI Key:
Data: 1 KI
Activity Spreadsheet -- Enzyme Inhibition Constant Data from BindingDB
Found 1 hit for monomerid = 153829
Trg + Lig
Ki
nM
ΔG°
kcal/mole
IC50
nM
Kd
nM
EC50/IC50
nM
koff
s-1
kon
M-1s-1
pHTemp
°C
PKC alpha and beta-2
(Homo sapiens (Human))
BDBM153829
(US8999981, A74)
Show SMILES C[C@H]1CN2CCC[C@H]2CN1C(=O)N1Cc2c(NC(=O)c3nc(Cl)c(Cl)s3)n[nH]c2C1(C)C |r|
NCI pathway
Reactome pathway
US Patent
10.4 -11.1n/an/an/an/an/a7.430
Pfizer Inc.; Pfizer Products Inc.
US Patent
Assay Description
Protein Kinase C beta 2 (PKC beta II) catalyzes the production of ADP from ATP that accompanies the phosphoryl transfer to the PKC Pseudosubstrate pe...
US Patent US8999981 (2015)
BindingDB Entry DOI: 10.7270/Q2RR1X0K