BDBM1539 2-ethyl-5-[(2-hydroxyethyl)(methyl)amino]-7-methyl-2,4,9,15-tetraazatricyclo[9.4.0.0^{3,8}]pentadeca-1(11),3,5,7,12,14-hexaen-10-one::5,11-dihydro-2-[N-(hydroxyethyl)-N-methylamino]-11-ethyl-4-methyl-6H-dipyrido[3,2-b:2 ,3 -e][1,4]diazepin-6-one::Dipyridodiazepinone deriv. 26
SMILES: CCN1c2nc(cc(C)c2NC(=O)c2cccnc12)N(C)CCO
InChI Key: InChIKey=PKTDOGBMTZCKJY-UHFFFAOYSA-N
Data: 2 IC50
Activity Spreadsheet -- Enzyme Inhibition Constant Data from BindingDB
Found 2 hits for monomerid = 1539
Trg + Lig
Ki
nM
ΔG°
kcal/mole
IC50
nM
Kd
nM
EC50/IC50
nM
koff
s-1
kon
M-1s-1
pHTemp
°C
HIV-1 Reverse Transcriptase Mutant (Y181C)
(Human immunodeficiency virus type 1)
BDBM1539
(2-ethyl-5-[(2-hydroxyethyl)(methyl)amino]-7-methyl...)
Show SMILES CCN1c2nc(cc(C)c2NC(=O)c2cccnc12)N(C)CCO
Show InChI InChI=1S/C17H21N5O2/c1-4-22-15-12(6-5-7-18-15)17(24)20-14-11(2)10-13(19-16(14)22)21(3)8-9-23/h5-7,10,23H,4,8-9H2,1-3H3,(H,20,24)
n/an/a>1.00E+3n/an/an/an/an/an/a
Boehringer Ingelheim Pharmaceuticals Inc.
Assay Description
The IC50 of reverse transcriptase is the concentration that inhibits 50% of recombinant HIV-1 RT RNA-directed DNA polymerase activity in vitro.
J Med Chem 38: 4830-8 (1995)
Article DOI: 10.1021/jm00024a010
BindingDB Entry DOI: 10.7270/Q23B5XBJ
HIV-1 Reverse Transcriptase
(Human immunodeficiency virus type 1)
BDBM1539
(2-ethyl-5-[(2-hydroxyethyl)(methyl)amino]-7-methyl...)
Show SMILES CCN1c2nc(cc(C)c2NC(=O)c2cccnc12)N(C)CCO
Show InChI InChI=1S/C17H21N5O2/c1-4-22-15-12(6-5-7-18-15)17(24)20-14-11(2)10-13(19-16(14)22)21(3)8-9-23/h5-7,10,23H,4,8-9H2,1-3H3,(H,20,24)
n/an/a 10n/an/an/an/an/an/a
Boehringer Ingelheim Pharmaceuticals Inc.
Assay Description
The IC50 of reverse transcriptase is the concentration that inhibits 50% of recombinant HIV-1 RT RNA-directed DNA polymerase activity in vitro.
J Med Chem 38: 4830-8 (1995)
Article DOI: 10.1021/jm00024a010
BindingDB Entry DOI: 10.7270/Q23B5XBJ