BDBM15402 N-[4-hydroxy-3-(2-hydroxy-1-naphthalenyl)phenyl]benzenesulfonamide::N-[4-hydroxy-3-(2-hydroxy-1-naphthyl)phenyl]benzenesulfonamide::N-[4-hydroxy-3-(2-hydroxynaphthalen-1-yl)phenyl]benzenesulfonamide::N-[4-oxidanyl-3-(2-oxidanylnaphthalen-1-yl)phenyl]benzenesulfonamide::cid_1073704::naphthol compound 5
SMILES: Oc1ccc(NS(=O)(=O)c2ccccc2)cc1-c1c(O)ccc2ccccc12
InChI Key: InChIKey=UUWGREFGSDPMIN-UHFFFAOYSA-N
Data: 3 IC50
PDB links: 1 PDB ID contains this monomer as substructures. 1 PDB ID contains inhibitors having a similarity of 90% to this monomer.
Activity Spreadsheet -- Enzyme Inhibition Constant Data from BindingDB
Found 3 hits for monomerid = 15402
Trg + Lig
Ki
nM
ΔG°
kcal/mole
IC50
nM
Kd
nM
EC50/IC50
nM
koff
s-1
kon
M-1s-1
pHTemp
°C
Heat shock protein HSP 90-beta
(Homo sapiens (Human))
BDBM15402
(N-[4-hydroxy-3-(2-hydroxy-1-naphthalenyl)phenyl]be...)
Show SMILES Oc1ccc(NS(=O)(=O)c2ccccc2)cc1-c1c(O)ccc2ccccc12 |(-4.43,.59,;-4.43,2.13,;-5.77,2.9,;-5.77,4.45,;-4.43,5.22,;-4.43,6.76,;-3.1,7.53,;-3.87,8.86,;-2.33,6.19,;-1.77,8.3,;-1.77,9.84,;-.43,10.61,;.9,9.84,;.9,8.3,;-.43,7.53,;-3.1,4.45,;-3.1,2.9,;-1.77,2.13,;-1.77,.59,;-3.1,-.18,;-.43,-.18,;.9,.59,;.9,2.13,;2.23,2.91,;2.23,4.45,;.9,5.22,;-.43,4.45,;-.43,2.91,)|
Show InChI InChI=1S/C22H17NO4S/c24-20-13-11-16(23-28(26,27)17-7-2-1-3-8-17)14-19(20)22-18-9-5-4-6-15(18)10-12-21(22)25/h1-14,23-25H
Reactome pathway
n/an/a 3.30E+3n/an/an/an/a7.422
Vernalis (R&D) Ltd
Assay Description
The assay is based upon displacement of a fluorescently labeled molecule, which binds specifically to the ATP-binding site of full-length human Hsp90...
Bioorg Med Chem Lett 15: 5187-91 (2005)
Article DOI: 10.1016/j.bmcl.2005.08.092
BindingDB Entry DOI: 10.7270/Q2HH6H9Z
Heat Shock Protein 90 (Hsp90)
(Homo sapiens (Human))
BDBM15402
(N-[4-hydroxy-3-(2-hydroxy-1-naphthalenyl)phenyl]be...)
Show SMILES Oc1ccc(NS(=O)(=O)c2ccccc2)cc1-c1c(O)ccc2ccccc12 |(-4.43,.59,;-4.43,2.13,;-5.77,2.9,;-5.77,4.45,;-4.43,5.22,;-4.43,6.76,;-3.1,7.53,;-3.87,8.86,;-2.33,6.19,;-1.77,8.3,;-1.77,9.84,;-.43,10.61,;.9,9.84,;.9,8.3,;-.43,7.53,;-3.1,4.45,;-3.1,2.9,;-1.77,2.13,;-1.77,.59,;-3.1,-.18,;-.43,-.18,;.9,.59,;.9,2.13,;2.23,2.91,;2.23,4.45,;.9,5.22,;-.43,4.45,;-.43,2.91,)|
Show InChI InChI=1S/C22H17NO4S/c24-20-13-11-16(23-28(26,27)17-7-2-1-3-8-17)14-19(20)22-18-9-5-4-6-15(18)10-12-21(22)25/h1-14,23-25H
Reactome pathway
n/an/a 4.50E+3n/an/an/an/an/an/a
Emory University
Curated by ChEMBL
Assay Description
Inhibition of Hsp90 in human SKBR3 cells assessed as interaction with Cy3b-conjugated geldanamycin by FP assay
Bioorg Med Chem Lett 18: 4982-7 (2008)
Article DOI: 10.1016/j.bmcl.2008.08.022
BindingDB Entry DOI: 10.7270/Q2Z89G6Z
Heat shock protein HSP 90-alpha
(Homo sapiens (Human))
BDBM15402
(N-[4-hydroxy-3-(2-hydroxy-1-naphthalenyl)phenyl]be...)
Show SMILES Oc1ccc(NS(=O)(=O)c2ccccc2)cc1-c1c(O)ccc2ccccc12 |(-4.43,.59,;-4.43,2.13,;-5.77,2.9,;-5.77,4.45,;-4.43,5.22,;-4.43,6.76,;-3.1,7.53,;-3.87,8.86,;-2.33,6.19,;-1.77,8.3,;-1.77,9.84,;-.43,10.61,;.9,9.84,;.9,8.3,;-.43,7.53,;-3.1,4.45,;-3.1,2.9,;-1.77,2.13,;-1.77,.59,;-3.1,-.18,;-.43,-.18,;.9,.59,;.9,2.13,;2.23,2.91,;2.23,4.45,;.9,5.22,;-.43,4.45,;-.43,2.91,)|
Show InChI InChI=1S/C22H17NO4S/c24-20-13-11-16(23-28(26,27)17-7-2-1-3-8-17)14-19(20)22-18-9-5-4-6-15(18)10-12-21(22)25/h1-14,23-25H
NCI pathway
Reactome pathway
PCBioAssay
n/an/a 1.30E+4n/an/an/an/a7.423
Emory University Molecular Libraries Screening Center
Curated by PubChem BioAssay
Assay Description
A fluorescence polarization based HTS assay has been developed and optimized for the identification of Hsp90 inhibitors by using tumor cell lysate Hs...
PubChem Bioassay (2007)
BindingDB Entry DOI: 10.7270/Q2Q23XM6