null
SMILES: O=C(NCCN1CCC2(CC1)N(Cc1cccnc1)CNC2=O)c1ccc2ccccc2c1
InChI Key: InChIKey=VBJYNYMKFQGJCH-UHFFFAOYSA-N
Activity Spreadsheet -- Enzyme Inhibition Constant Data from BindingDB
Found 5 hits for monomerid = 154518
Trg + Lig
Ki
nM
ΔG°
kcal/mole
IC50
nM
Kd
nM
EC50/IC50
nM
koff
s-1
kon
M-1s-1
pHTemp
°C
Phospholipase D1
(Homo sapiens (Human))
BDBM154518
(ML395 (6))
Show SMILES O=C(NCCN1CCC2(CC1)N(Cc1cccnc1)CNC2=O)c1ccc2ccccc2c1
Show InChI InChI=1S/C26H29N5O2/c32-24(23-8-7-21-5-1-2-6-22(21)16-23)28-12-15-30-13-9-26(10-14-30)25(33)29-19-31(26)18-20-4-3-11-27-17-20/h1-8,11,16-17H,9-10,12-15,18-19H2,(H,28,32)(H,29,33)
n/an/a>3.00E+4n/an/an/an/an/an/a
Vanderbilt University
Assay Description
Cells were seeded into 12-well tissue culture plates to reach 90% confluence at the time of assay. All cell types, aside from the HEK293-gfpPLD2 cell...
ACS Chem Biol 10: 421-32 (2015)
Article DOI: 10.1021/cb500828m
BindingDB Entry DOI: 10.7270/Q2H70DK8
Phospholipase D2
(Homo sapiens (Human))
BDBM154518
(ML395 (6))
Show SMILES O=C(NCCN1CCC2(CC1)N(Cc1cccnc1)CNC2=O)c1ccc2ccccc2c1
Show InChI InChI=1S/C26H29N5O2/c32-24(23-8-7-21-5-1-2-6-22(21)16-23)28-12-15-30-13-9-26(10-14-30)25(33)29-19-31(26)18-20-4-3-11-27-17-20/h1-8,11,16-17H,9-10,12-15,18-19H2,(H,28,32)(H,29,33)
Reactome pathway
n/an/a 380n/an/an/an/an/an/a
Vanderbilt University
Assay Description
Cells were seeded into 12-well tissue culture plates to reach 90% confluence at the time of assay. All cell types, aside from the HEK293-gfpPLD2 cell...
ACS Chem Biol 10: 421-32 (2015)
Article DOI: 10.1021/cb500828m
BindingDB Entry DOI: 10.7270/Q2H70DK8
Phospholipase D2
(Homo sapiens (Human))
BDBM154518
(ML395 (6))
Show SMILES O=C(NCCN1CCC2(CC1)N(Cc1cccnc1)CNC2=O)c1ccc2ccccc2c1
Show InChI InChI=1S/C26H29N5O2/c32-24(23-8-7-21-5-1-2-6-22(21)16-23)28-12-15-30-13-9-26(10-14-30)25(33)29-19-31(26)18-20-4-3-11-27-17-20/h1-8,11,16-17H,9-10,12-15,18-19H2,(H,28,32)(H,29,33)
Reactome pathway
n/an/a 360n/an/an/an/an/an/a
Vanderbilt University Medical Center
Curated by ChEMBL
Assay Description
Inhibition of PLD2 (unknown origin)
Bioorg Med Chem Lett 28: 3670-3673 (2018)
Article DOI: 10.1016/j.bmcl.2018.10.033
Phospholipase D1
(Homo sapiens (Human))
BDBM154518
(ML395 (6))
Show SMILES O=C(NCCN1CCC2(CC1)N(Cc1cccnc1)CNC2=O)c1ccc2ccccc2c1
Show InChI InChI=1S/C26H29N5O2/c32-24(23-8-7-21-5-1-2-6-22(21)16-23)28-12-15-30-13-9-26(10-14-30)25(33)29-19-31(26)18-20-4-3-11-27-17-20/h1-8,11,16-17H,9-10,12-15,18-19H2,(H,28,32)(H,29,33)
n/an/a>3.00E+4n/an/an/an/an/an/a
Vanderbilt University Medical Center
Curated by ChEMBL
Assay Description
Inhibition of PLD1 (unknown origin)
Bioorg Med Chem Lett 28: 3670-3673 (2018)
Article DOI: 10.1016/j.bmcl.2018.10.033
Phospholipase
(Pseudomonas aeruginosa (g-Proteobacteria))
BDBM154518
(ML395 (6))
Show SMILES O=C(NCCN1CCC2(CC1)N(Cc1cccnc1)CNC2=O)c1ccc2ccccc2c1
Show InChI InChI=1S/C26H29N5O2/c32-24(23-8-7-21-5-1-2-6-22(21)16-23)28-12-15-30-13-9-26(10-14-30)25(33)29-19-31(26)18-20-4-3-11-27-17-20/h1-8,11,16-17H,9-10,12-15,18-19H2,(H,28,32)(H,29,33)
n/an/a>2.00E+4n/an/an/an/a7.5n/a
Vanderbilt University
Assay Description
In brief, 6 nM purified PldA was incubated with liposomes containing 90 μM 1,2-dioleoyl-sn-glycero-3-phospho-(1′-rac-glycerol), 10 μM...
ACS Chem Biol 10: 421-32 (2015)
Article DOI: 10.1021/cb500828m
BindingDB Entry DOI: 10.7270/Q2H70DK8