BDBM154554 (3-Bromophenyl)(4-(tert-butyl)piperazin-1-yl)methanone (10)
SMILES: CC(C)(C)N1CCN(CC1)C(=O)c1cccc(Br)c1
InChI Key: InChIKey=AIAVNBRCOLXLIC-UHFFFAOYSA-N
Data: 10 IC50
Activity Spreadsheet -- Enzyme Inhibition Constant Data from BindingDB
Found 10 hits for monomerid = 154554
Trg + Lig
Ki
nM
ΔG°
kcal/mole
IC50
nM
Kd
nM
EC50/IC50
nM
koff
s-1
kon
M-1s-1
pHTemp
°C
Methyl-lysine binding protein (53BP1)
(Homo sapiens (Human))
BDBM154554
((3-Bromophenyl)(4-(tert-butyl)piperazin-1-yl)metha...)
Show SMILES CC(C)(C)N1CCN(CC1)C(=O)c1cccc(Br)c1
Show InChI InChI=1S/C15H21BrN2O/c1-15(2,3)18-9-7-17(8-10-18)14(19)12-5-4-6-13(16)11-12/h4-6,11H,7-10H2,1-3H3
Reactome pathway
n/an/a>1.00E+5n/an/an/an/a8.01,390.75
University of North Carolina at Chapel Hill
Assay Description
In brief, compound plates (1 μL at 10 mM highest concentration; 3-fold, 10-point dilutions in DMSO) were diluted in 1X assay buffer (20 mM TRIS ...
ACS Chem Biol 10: 1072-81 (2015)
Article DOI: 10.1021/cb500956g
BindingDB Entry DOI: 10.7270/Q27S7MHJ
Chromobox protein homolog 7 (CBX7)
(Homo sapiens (Human))
BDBM154554
((3-Bromophenyl)(4-(tert-butyl)piperazin-1-yl)metha...)
Show SMILES CC(C)(C)N1CCN(CC1)C(=O)c1cccc(Br)c1
Show InChI InChI=1S/C15H21BrN2O/c1-15(2,3)18-9-7-17(8-10-18)14(19)12-5-4-6-13(16)11-12/h4-6,11H,7-10H2,1-3H3
n/an/a>1.00E+5n/an/an/an/a8.01,390.75
University of North Carolina at Chapel Hill
Assay Description
In brief, compound plates (1 μL at 10 mM highest concentration; 3-fold, 10-point dilutions in DMSO) were diluted in 1X assay buffer (20 mM TRIS ...
ACS Chem Biol 10: 1072-81 (2015)
Article DOI: 10.1021/cb500956g
BindingDB Entry DOI: 10.7270/Q27S7MHJ
Lysine-specific demethylase 5A
(Homo sapiens (Human))
BDBM154554
((3-Bromophenyl)(4-(tert-butyl)piperazin-1-yl)metha...)
Show SMILES CC(C)(C)N1CCN(CC1)C(=O)c1cccc(Br)c1
Show InChI InChI=1S/C15H21BrN2O/c1-15(2,3)18-9-7-17(8-10-18)14(19)12-5-4-6-13(16)11-12/h4-6,11H,7-10H2,1-3H3
Reactome pathway
n/an/a>1.00E+5n/an/an/an/a8.01,390.75
University of North Carolina at Chapel Hill
Assay Description
In brief, compound plates (1 μL at 10 mM highest concentration; 3-fold, 10-point dilutions in DMSO) were diluted in 1X assay buffer (20 mM TRIS ...
ACS Chem Biol 10: 1072-81 (2015)
Article DOI: 10.1021/cb500956g
BindingDB Entry DOI: 10.7270/Q27S7MHJ
PHD finger protein 1 (PHF1)
(Homo sapiens (Human))
BDBM154554
((3-Bromophenyl)(4-(tert-butyl)piperazin-1-yl)metha...)
Show SMILES CC(C)(C)N1CCN(CC1)C(=O)c1cccc(Br)c1
Show InChI InChI=1S/C15H21BrN2O/c1-15(2,3)18-9-7-17(8-10-18)14(19)12-5-4-6-13(16)11-12/h4-6,11H,7-10H2,1-3H3
n/an/a>1.00E+5n/an/an/an/a8.01,390.75
University of North Carolina at Chapel Hill
Assay Description
In brief, compound plates (1 μL at 10 mM highest concentration; 3-fold, 10-point dilutions in DMSO) were diluted in 1X assay buffer (20 mM TRIS ...
ACS Chem Biol 10: 1072-81 (2015)
Article DOI: 10.1021/cb500956g
BindingDB Entry DOI: 10.7270/Q27S7MHJ
MBT domain-containing protein 1 (MBTD1)
(Homo sapiens (Human))
BDBM154554
((3-Bromophenyl)(4-(tert-butyl)piperazin-1-yl)metha...)
Show SMILES CC(C)(C)N1CCN(CC1)C(=O)c1cccc(Br)c1
Show InChI InChI=1S/C15H21BrN2O/c1-15(2,3)18-9-7-17(8-10-18)14(19)12-5-4-6-13(16)11-12/h4-6,11H,7-10H2,1-3H3
n/an/a>1.00E+5n/an/an/an/a8.01,390.75
University of North Carolina at Chapel Hill
Assay Description
In brief, compound plates (1 μL at 10 mM highest concentration; 3-fold, 10-point dilutions in DMSO) were diluted in 1X assay buffer (20 mM TRIS ...
ACS Chem Biol 10: 1072-81 (2015)
Article DOI: 10.1021/cb500956g
BindingDB Entry DOI: 10.7270/Q27S7MHJ
PHD finger protein 23 (PHF23)
(Homo sapiens (Human))
BDBM154554
((3-Bromophenyl)(4-(tert-butyl)piperazin-1-yl)metha...)
Show SMILES CC(C)(C)N1CCN(CC1)C(=O)c1cccc(Br)c1
Show InChI InChI=1S/C15H21BrN2O/c1-15(2,3)18-9-7-17(8-10-18)14(19)12-5-4-6-13(16)11-12/h4-6,11H,7-10H2,1-3H3
n/an/a>1.00E+5n/an/an/an/a8.01,390.75
University of North Carolina at Chapel Hill
Assay Description
In brief, compound plates (1 μL at 10 mM highest concentration; 3-fold, 10-point dilutions in DMSO) were diluted in 1X assay buffer (20 mM TRIS ...
ACS Chem Biol 10: 1072-81 (2015)
Article DOI: 10.1021/cb500956g
BindingDB Entry DOI: 10.7270/Q27S7MHJ
E3 ubiquitin-protein ligase (UHRF1)
(Homo sapiens (Human))
BDBM154554
((3-Bromophenyl)(4-(tert-butyl)piperazin-1-yl)metha...)
Show SMILES CC(C)(C)N1CCN(CC1)C(=O)c1cccc(Br)c1
Show InChI InChI=1S/C15H21BrN2O/c1-15(2,3)18-9-7-17(8-10-18)14(19)12-5-4-6-13(16)11-12/h4-6,11H,7-10H2,1-3H3
n/an/a>1.00E+5n/an/an/an/a8.01,390.75
University of North Carolina at Chapel Hill
Assay Description
In brief, compound plates (1 μL at 10 mM highest concentration; 3-fold, 10-point dilutions in DMSO) were diluted in 1X assay buffer (20 mM TRIS ...
ACS Chem Biol 10: 1072-81 (2015)
Article DOI: 10.1021/cb500956g
BindingDB Entry DOI: 10.7270/Q27S7MHJ
Lethal(3)malignant brain tumor-like protein 1 (L3MBTL1)
(Homo sapiens (Human))
BDBM154554
((3-Bromophenyl)(4-(tert-butyl)piperazin-1-yl)metha...)
Show SMILES CC(C)(C)N1CCN(CC1)C(=O)c1cccc(Br)c1
Show InChI InChI=1S/C15H21BrN2O/c1-15(2,3)18-9-7-17(8-10-18)14(19)12-5-4-6-13(16)11-12/h4-6,11H,7-10H2,1-3H3
n/an/a>1.00E+5n/an/an/an/a8.01,390.75
University of North Carolina at Chapel Hill
Assay Description
In brief, compound plates (1 μL at 10 mM highest concentration; 3-fold, 10-point dilutions in DMSO) were diluted in 1X assay buffer (20 mM TRIS ...
ACS Chem Biol 10: 1072-81 (2015)
Article DOI: 10.1021/cb500956g
BindingDB Entry DOI: 10.7270/Q27S7MHJ
Lethal(3)malignant brain tumor-like protein 3 (L3MBTL3)
(Homo sapiens (Human))
BDBM154554
((3-Bromophenyl)(4-(tert-butyl)piperazin-1-yl)metha...)
Show SMILES CC(C)(C)N1CCN(CC1)C(=O)c1cccc(Br)c1
Show InChI InChI=1S/C15H21BrN2O/c1-15(2,3)18-9-7-17(8-10-18)14(19)12-5-4-6-13(16)11-12/h4-6,11H,7-10H2,1-3H3
n/an/a>1.00E+5n/an/an/an/a8.01,390.75
University of North Carolina at Chapel Hill
Assay Description
In brief, compound plates (1 μL at 10 mM highest concentration; 3-fold, 10-point dilutions in DMSO) were diluted in 1X assay buffer (20 mM TRIS ...
ACS Chem Biol 10: 1072-81 (2015)
Article DOI: 10.1021/cb500956g
BindingDB Entry DOI: 10.7270/Q27S7MHJ
PHD finger protein 19 (PHF19)
(Homo sapiens (Human))
BDBM154554
((3-Bromophenyl)(4-(tert-butyl)piperazin-1-yl)metha...)
Show SMILES CC(C)(C)N1CCN(CC1)C(=O)c1cccc(Br)c1
Show InChI InChI=1S/C15H21BrN2O/c1-15(2,3)18-9-7-17(8-10-18)14(19)12-5-4-6-13(16)11-12/h4-6,11H,7-10H2,1-3H3
n/an/a>1.00E+5n/an/an/an/a8.01,390.75
University of North Carolina at Chapel Hill
Assay Description
In brief, compound plates (1 μL at 10 mM highest concentration; 3-fold, 10-point dilutions in DMSO) were diluted in 1X assay buffer (20 mM TRIS ...
ACS Chem Biol 10: 1072-81 (2015)
Article DOI: 10.1021/cb500956g
BindingDB Entry DOI: 10.7270/Q27S7MHJ