BDBM154567 N-(3-(Tert-butylamino)propyl)-3-nitrobenzamide (23)
SMILES: CC(C)(C)NCCCNC(=O)c1cccc(c1)[N+]([O-])=O
InChI Key: InChIKey=OJQHLBIKDBBOQQ-UHFFFAOYSA-N
Data: 10 IC50
Activity Spreadsheet -- Enzyme Inhibition Constant Data from BindingDB
Found 10 hits for monomerid = 154567
Trg + Lig
Ki
nM
ΔG°
kcal/mole
IC50
nM
Kd
nM
EC50/IC50
nM
koff
s-1
kon
M-1s-1
pHTemp
°C
Methyl-lysine binding protein (53BP1)
(Homo sapiens (Human))
BDBM154567
(N-(3-(Tert-butylamino)propyl)-3-nitrobenzamide (23...)
Show SMILES CC(C)(C)NCCCNC(=O)c1cccc(c1)[N+]([O-])=O
Show InChI InChI=1S/C14H21N3O3/c1-14(2,3)16-9-5-8-15-13(18)11-6-4-7-12(10-11)17(19)20/h4,6-7,10,16H,5,8-9H2,1-3H3,(H,15,18)
Reactome pathway
n/an/a>1.00E+5n/an/an/an/a8.01,117.6
University of North Carolina at Chapel Hill
Assay Description
In brief, compound plates (1 μL at 10 mM highest concentration; 3-fold, 10-point dilutions in DMSO) were diluted in 1X assay buffer (20 mM TRIS ...
ACS Chem Biol 10: 1072-81 (2015)
Article DOI: 10.1021/cb500956g
BindingDB Entry DOI: 10.7270/Q27S7MHJ
Chromobox protein homolog 7 (CBX7)
(Homo sapiens (Human))
BDBM154567
(N-(3-(Tert-butylamino)propyl)-3-nitrobenzamide (23...)
Show SMILES CC(C)(C)NCCCNC(=O)c1cccc(c1)[N+]([O-])=O
Show InChI InChI=1S/C14H21N3O3/c1-14(2,3)16-9-5-8-15-13(18)11-6-4-7-12(10-11)17(19)20/h4,6-7,10,16H,5,8-9H2,1-3H3,(H,15,18)
n/an/a>1.00E+5n/an/an/an/a8.01,117.6
University of North Carolina at Chapel Hill
Assay Description
In brief, compound plates (1 μL at 10 mM highest concentration; 3-fold, 10-point dilutions in DMSO) were diluted in 1X assay buffer (20 mM TRIS ...
ACS Chem Biol 10: 1072-81 (2015)
Article DOI: 10.1021/cb500956g
BindingDB Entry DOI: 10.7270/Q27S7MHJ
Lysine-specific demethylase 5A
(Homo sapiens (Human))
BDBM154567
(N-(3-(Tert-butylamino)propyl)-3-nitrobenzamide (23...)
Show SMILES CC(C)(C)NCCCNC(=O)c1cccc(c1)[N+]([O-])=O
Show InChI InChI=1S/C14H21N3O3/c1-14(2,3)16-9-5-8-15-13(18)11-6-4-7-12(10-11)17(19)20/h4,6-7,10,16H,5,8-9H2,1-3H3,(H,15,18)
Reactome pathway
n/an/a>1.00E+5n/an/an/an/a8.01,117.6
University of North Carolina at Chapel Hill
Assay Description
In brief, compound plates (1 μL at 10 mM highest concentration; 3-fold, 10-point dilutions in DMSO) were diluted in 1X assay buffer (20 mM TRIS ...
ACS Chem Biol 10: 1072-81 (2015)
Article DOI: 10.1021/cb500956g
BindingDB Entry DOI: 10.7270/Q27S7MHJ
PHD finger protein 1 (PHF1)
(Homo sapiens (Human))
BDBM154567
(N-(3-(Tert-butylamino)propyl)-3-nitrobenzamide (23...)
Show SMILES CC(C)(C)NCCCNC(=O)c1cccc(c1)[N+]([O-])=O
Show InChI InChI=1S/C14H21N3O3/c1-14(2,3)16-9-5-8-15-13(18)11-6-4-7-12(10-11)17(19)20/h4,6-7,10,16H,5,8-9H2,1-3H3,(H,15,18)
n/an/a>1.00E+5n/an/an/an/a8.0844.45
University of North Carolina at Chapel Hill
Assay Description
In brief, compound plates (1 μL at 10 mM highest concentration; 3-fold, 10-point dilutions in DMSO) were diluted in 1X assay buffer (20 mM TRIS ...
ACS Chem Biol 10: 1072-81 (2015)
Article DOI: 10.1021/cb500956g
BindingDB Entry DOI: 10.7270/Q27S7MHJ
MBT domain-containing protein 1 (MBTD1)
(Homo sapiens (Human))
BDBM154567
(N-(3-(Tert-butylamino)propyl)-3-nitrobenzamide (23...)
Show SMILES CC(C)(C)NCCCNC(=O)c1cccc(c1)[N+]([O-])=O
Show InChI InChI=1S/C14H21N3O3/c1-14(2,3)16-9-5-8-15-13(18)11-6-4-7-12(10-11)17(19)20/h4,6-7,10,16H,5,8-9H2,1-3H3,(H,15,18)
n/an/a>1.00E+5n/an/an/an/a8.0571.3
University of North Carolina at Chapel Hill
Assay Description
In brief, compound plates (1 μL at 10 mM highest concentration; 3-fold, 10-point dilutions in DMSO) were diluted in 1X assay buffer (20 mM TRIS ...
ACS Chem Biol 10: 1072-81 (2015)
Article DOI: 10.1021/cb500956g
BindingDB Entry DOI: 10.7270/Q27S7MHJ
PHD finger protein 23 (PHF23)
(Homo sapiens (Human))
BDBM154567
(N-(3-(Tert-butylamino)propyl)-3-nitrobenzamide (23...)
Show SMILES CC(C)(C)NCCCNC(=O)c1cccc(c1)[N+]([O-])=O
Show InChI InChI=1S/C14H21N3O3/c1-14(2,3)16-9-5-8-15-13(18)11-6-4-7-12(10-11)17(19)20/h4,6-7,10,16H,5,8-9H2,1-3H3,(H,15,18)
n/an/a>1.00E+5n/an/an/an/a8.0844.45
University of North Carolina at Chapel Hill
Assay Description
In brief, compound plates (1 μL at 10 mM highest concentration; 3-fold, 10-point dilutions in DMSO) were diluted in 1X assay buffer (20 mM TRIS ...
ACS Chem Biol 10: 1072-81 (2015)
Article DOI: 10.1021/cb500956g
BindingDB Entry DOI: 10.7270/Q27S7MHJ
E3 ubiquitin-protein ligase (UHRF1)
(Homo sapiens (Human))
BDBM154567
(N-(3-(Tert-butylamino)propyl)-3-nitrobenzamide (23...)
Show SMILES CC(C)(C)NCCCNC(=O)c1cccc(c1)[N+]([O-])=O
Show InChI InChI=1S/C14H21N3O3/c1-14(2,3)16-9-5-8-15-13(18)11-6-4-7-12(10-11)17(19)20/h4,6-7,10,16H,5,8-9H2,1-3H3,(H,15,18)
n/an/a>1.00E+5n/an/an/an/a8.0571.3
University of North Carolina at Chapel Hill
Assay Description
In brief, compound plates (1 μL at 10 mM highest concentration; 3-fold, 10-point dilutions in DMSO) were diluted in 1X assay buffer (20 mM TRIS ...
ACS Chem Biol 10: 1072-81 (2015)
Article DOI: 10.1021/cb500956g
BindingDB Entry DOI: 10.7270/Q27S7MHJ
Lethal(3)malignant brain tumor-like protein 1 (L3MBTL1)
(Homo sapiens (Human))
BDBM154567
(N-(3-(Tert-butylamino)propyl)-3-nitrobenzamide (23...)
Show SMILES CC(C)(C)NCCCNC(=O)c1cccc(c1)[N+]([O-])=O
Show InChI InChI=1S/C14H21N3O3/c1-14(2,3)16-9-5-8-15-13(18)11-6-4-7-12(10-11)17(19)20/h4,6-7,10,16H,5,8-9H2,1-3H3,(H,15,18)
n/an/a>1.00E+5n/an/an/an/a8.0571.3
University of North Carolina at Chapel Hill
Assay Description
In brief, compound plates (1 μL at 10 mM highest concentration; 3-fold, 10-point dilutions in DMSO) were diluted in 1X assay buffer (20 mM TRIS ...
ACS Chem Biol 10: 1072-81 (2015)
Article DOI: 10.1021/cb500956g
BindingDB Entry DOI: 10.7270/Q27S7MHJ
Lethal(3)malignant brain tumor-like protein 3 (L3MBTL3)
(Homo sapiens (Human))
BDBM154567
(N-(3-(Tert-butylamino)propyl)-3-nitrobenzamide (23...)
Show SMILES CC(C)(C)NCCCNC(=O)c1cccc(c1)[N+]([O-])=O
Show InChI InChI=1S/C14H21N3O3/c1-14(2,3)16-9-5-8-15-13(18)11-6-4-7-12(10-11)17(19)20/h4,6-7,10,16H,5,8-9H2,1-3H3,(H,15,18)
n/an/a>1.00E+5n/an/an/an/a8.0571.3
University of North Carolina at Chapel Hill
Assay Description
In brief, compound plates (1 μL at 10 mM highest concentration; 3-fold, 10-point dilutions in DMSO) were diluted in 1X assay buffer (20 mM TRIS ...
ACS Chem Biol 10: 1072-81 (2015)
Article DOI: 10.1021/cb500956g
BindingDB Entry DOI: 10.7270/Q27S7MHJ
PHD finger protein 19 (PHF19)
(Homo sapiens (Human))
BDBM154567
(N-(3-(Tert-butylamino)propyl)-3-nitrobenzamide (23...)
Show SMILES CC(C)(C)NCCCNC(=O)c1cccc(c1)[N+]([O-])=O
Show InChI InChI=1S/C14H21N3O3/c1-14(2,3)16-9-5-8-15-13(18)11-6-4-7-12(10-11)17(19)20/h4,6-7,10,16H,5,8-9H2,1-3H3,(H,15,18)
n/an/a>1.00E+5n/an/an/an/a8.0844.45
University of North Carolina at Chapel Hill
Assay Description
In brief, compound plates (1 μL at 10 mM highest concentration; 3-fold, 10-point dilutions in DMSO) were diluted in 1X assay buffer (20 mM TRIS ...
ACS Chem Biol 10: 1072-81 (2015)
Article DOI: 10.1021/cb500956g
BindingDB Entry DOI: 10.7270/Q27S7MHJ