BDBM154571 4-Methylthio 2-oxobutyric acid (MTOB)
SMILES: CSCCC(=O)C(O)=O
InChI Key: InChIKey=SXFSQZDSUWACKX-UHFFFAOYSA-N
Data: 1 IC50  2 Kd  2 ITC
PDB links: 6 PDB IDs match this monomer.
Activity Spreadsheet -- Enzyme Inhibition Constant Data from BindingDB
Found 3 hits for monomerid = 154571
Trg + Lig
Ki
nM
ΔG°
kcal/mole
IC50
nM
Kd
nM
EC50/IC50
nM
koff
s-1
kon
M-1s-1
pHTemp
°C
C-terminal-binding protein 2 (CtBP2)
(Homo sapiens (Human))
BDBM154571
(4-Methylthio 2-oxobutyric acid (MTOB))
Show SMILES CSCCC(=O)C(O)=O
Show InChI InChI=1S/C5H8O3S/c1-9-3-2-4(6)5(7)8/h2-3H2,1H3,(H,7,8)
n/an/an/a 2.96E+6n/an/an/a8.5n/a
University of Massachusetts Medical School
Assay Description
Purified CtBP2 was dialyzed overnight against 500 mL of 50 mM glycylglycine at pH 8.5, 300 mM NaCl, 1 mM EDTA, and 2 mM TCEP, with or without 1.5 mM ...
ACS Chem Biol 10: 1118-27 (2015)
Article DOI: 10.1021/cb500820b
BindingDB Entry DOI: 10.7270/Q2416VTK
3D
3D Structure (crystal)
C-terminal-binding protein 2
(Homo sapiens (Human))
BDBM154571
(4-Methylthio 2-oxobutyric acid (MTOB))
Show SMILES CSCCC(=O)C(O)=O
Show InChI InChI=1S/C5H8O3S/c1-9-3-2-4(6)5(7)8/h2-3H2,1H3,(H,7,8)
n/an/a 3.00E+5n/an/an/an/an/an/a
Virginia Commonwealth University
Curated by ChEMBL
Assay Description
Inhibition of recombinant His6-tagged CtBP2 (31 to 384 residues) (unknown origin) dehydrogenase activity expressed in Escherichia coli BL21-Codonplus...
Bioorg Med Chem 24: 2707-15 (2016)
BindingDB Entry DOI: 10.7270/Q28P62FX
3D
3D Structure (crystal)
C-terminal-binding protein 1 (CtBP1)
(Homo sapiens (Human))
BDBM154571
(4-Methylthio 2-oxobutyric acid (MTOB))
Show SMILES CSCCC(=O)C(O)=O
Show InChI InChI=1S/C5H8O3S/c1-9-3-2-4(6)5(7)8/h2-3H2,1H3,(H,7,8)
n/an/an/a 1.26E+6n/an/an/a7.5n/a
University of Massachusetts Medical School
Assay Description
Purified CtBP2 was dialyzed overnight against 500 mL of 50 mM glycylglycine at pH 8.5, 300 mM NaCl, 1 mM EDTA, and 2 mM TCEP, with or without 1.5 mM ...
ACS Chem Biol 10: 1118-27 (2015)
Article DOI: 10.1021/cb500820b
BindingDB Entry DOI: 10.7270/Q2416VTK
3D
3D Structure (crystal)
Activity Spreadsheet -- ITC Data from BindingDB
Found 2 hits for monomerid = 154571
Cell (A)Syringe (B)Cell
Syringe
Cell + Syr
ΔG°
kcal/mole
-TΔS°
kcal/mole
ΔH°
kcal/mole
log KpHTemp
°C
C-terminal-binding protein 2 (CtBP2)
(Homo sapiens (Human))
BDBM154571
JPEG
(4-Methylthio 2-oxobutyric acid (MTOB))
-3.34n/a-3.342.498.520
University of Massachusetts Medical School
ACS Chem Biol 10: 1118-27 (2015)
C-terminal-binding protein 1 (CtBP1)
(Homo sapiens (Human))
BDBM154571
JPEG
(4-Methylthio 2-oxobutyric acid (MTOB))
-3.827.70-11.32.857.520
University of Massachusetts Medical School
ACS Chem Biol 10: 1118-27 (2015)