null
SMILES: CC(=O)C(=O)Oc1ccccc1
InChI Key: InChIKey=LMKPPOCIIACDQU-UHFFFAOYSA-N
Activity Spreadsheet -- Enzyme Inhibition Constant Data from BindingDB
Found 1 hit for monomerid = 154572
Trg + Lig
Ki
nM
ΔG°
kcal/mole
IC50
nM
Kd
nM
EC50/IC50
nM
koff
s-1
kon
M-1s-1
pHTemp
°C
C-terminal-binding protein 2
(Homo sapiens (Human))
BDBM154572
(Phenylpyruvate (PPy))
Show SMILES CC(=O)C(=O)Oc1ccccc1
Show InChI InChI=1S/C9H8O3/c1-7(10)9(11)12-8-5-3-2-4-6-8/h2-6H,1H3
n/an/a 1.35E+5n/an/an/an/a7.1n/a
University of Massachusetts Medical School
Assay Description
Purified CtBP2 in 50% glycerol was added to 150 μM NADH and variable amounts of MTOB and HIPP in buffer containing 25 mM HEPES, pH 7.1, 25 mM p...
ACS Chem Biol 10: 1118-27 (2015)
Article DOI: 10.1021/cb500820b
BindingDB Entry DOI: 10.7270/Q2416VTK