BDBM15459 4-[1-methyl-2-(piperidin-4-yl)-4-[3-(trifluoromethyl)phenyl]-1H-imidazol-5-yl]-N-[(1S)-1-phenylethyl]pyridin-2-amine::4-{1-methyl-2-piperidin-4-yl-4-[3-(trifluoromethyl)phenyl]-1H-imidazol-5-yl}-N-[(1S)-1-phenylethyl]pyridin-2-amine::CHEMBL303144::L-790070
SMILES: C[C@H](Nc1cc(ccn1)-c1c(nc(C2CCNCC2)n1C)-c1cccc(c1)C(F)(F)F)c1ccccc1
InChI Key: InChIKey=ZLQKJFNLHHGAQF-IBGZPJMESA-N
Data: 10 IC50
Activity Spreadsheet -- Enzyme Inhibition Constant Data from BindingDB
Found 10 hits for monomerid = 15459
Trg + Lig
Ki
nM
ΔG°
kcal/mole
IC50
nM
Kd
nM
EC50/IC50
nM
koff
s-1
kon
M-1s-1
pHTemp
°C
Mitogen-activated protein kinase 14
(Homo sapiens (Human))
BDBM15459
(4-[1-methyl-2-(piperidin-4-yl)-4-[3-(trifluorometh...)
Show SMILES C[C@H](Nc1cc(ccn1)-c1c(nc(C2CCNCC2)n1C)-c1cccc(c1)C(F)(F)F)c1ccccc1 |r|
Show InChI InChI=1S/C29H30F3N5/c1-19(20-7-4-3-5-8-20)35-25-18-23(13-16-34-25)27-26(22-9-6-10-24(17-22)29(30,31)32)36-28(37(27)2)21-11-14-33-15-12-21/h3-10,13,16-19,21,33H,11-12,14-15H2,1-2H3,(H,34,35)/t19-/m0/s1
NCI pathway
Reactome pathway
n/an/a 2n/an/an/an/an/an/a
Pfizer
Assay Description
The IC50s were determined by incubating each test compound with activated p38-alpha in a 96-well plate that had been pre-treated with ATF-2-GST to al...
Bioorg Med Chem Lett 14: 919-23 (2004)
Article DOI: 10.1016/j.bmcl.2003.12.023
BindingDB Entry DOI: 10.7270/Q28050V6
3D
3D Structure (docked)
Mitogen-activated protein kinase 9
(Homo sapiens (Human))
BDBM15459
(4-[1-methyl-2-(piperidin-4-yl)-4-[3-(trifluorometh...)
Show SMILES C[C@H](Nc1cc(ccn1)-c1c(nc(C2CCNCC2)n1C)-c1cccc(c1)C(F)(F)F)c1ccccc1 |r|
Show InChI InChI=1S/C29H30F3N5/c1-19(20-7-4-3-5-8-20)35-25-18-23(13-16-34-25)27-26(22-9-6-10-24(17-22)29(30,31)32)36-28(37(27)2)21-11-14-33-15-12-21/h3-10,13,16-19,21,33H,11-12,14-15H2,1-2H3,(H,34,35)/t19-/m0/s1
NCI pathway
Reactome pathway
n/an/a 1.17E+3n/an/an/an/an/an/a
Merck Research Laboratories
Curated by ChEMBL
Assay Description
Inhibition of c-Jun N-terminal kinase 2-alpha 1
J Med Chem 42: 2180-90 (1999)
Article DOI: 10.1021/jm9805236
BindingDB Entry DOI: 10.7270/Q2Q81C8D
Mitogen-activated protein kinase 9
(Homo sapiens (Human))
BDBM15459
(4-[1-methyl-2-(piperidin-4-yl)-4-[3-(trifluorometh...)
Show SMILES C[C@H](Nc1cc(ccn1)-c1c(nc(C2CCNCC2)n1C)-c1cccc(c1)C(F)(F)F)c1ccccc1 |r|
Show InChI InChI=1S/C29H30F3N5/c1-19(20-7-4-3-5-8-20)35-25-18-23(13-16-34-25)27-26(22-9-6-10-24(17-22)29(30,31)32)36-28(37(27)2)21-11-14-33-15-12-21/h3-10,13,16-19,21,33H,11-12,14-15H2,1-2H3,(H,34,35)/t19-/m0/s1
NCI pathway
Reactome pathway
n/an/a 2.20E+3n/an/an/an/an/an/a
Merck Research Laboratories
Curated by ChEMBL
Assay Description
Inhibition of c-Jun N-terminal kinase 2-alpha 2
J Med Chem 42: 2180-90 (1999)
Article DOI: 10.1021/jm9805236
BindingDB Entry DOI: 10.7270/Q2Q81C8D
RAF proto-oncogene serine/threonine-protein kinase
(Homo sapiens (Human))
BDBM15459
(4-[1-methyl-2-(piperidin-4-yl)-4-[3-(trifluorometh...)
Show SMILES C[C@H](Nc1cc(ccn1)-c1c(nc(C2CCNCC2)n1C)-c1cccc(c1)C(F)(F)F)c1ccccc1 |r|
Show InChI InChI=1S/C29H30F3N5/c1-19(20-7-4-3-5-8-20)35-25-18-23(13-16-34-25)27-26(22-9-6-10-24(17-22)29(30,31)32)36-28(37(27)2)21-11-14-33-15-12-21/h3-10,13,16-19,21,33H,11-12,14-15H2,1-2H3,(H,34,35)/t19-/m0/s1
NCI pathway
Reactome pathway
n/an/a 810n/an/an/an/an/an/a
Merck Research Laboratories
Curated by ChEMBL
Assay Description
Inhibition of human c-Raf kinase
J Med Chem 42: 2180-90 (1999)
Article DOI: 10.1021/jm9805236
BindingDB Entry DOI: 10.7270/Q2Q81C8D
Mitogen-activated protein kinase 9
(Homo sapiens (Human))
BDBM15459
(4-[1-methyl-2-(piperidin-4-yl)-4-[3-(trifluorometh...)
Show SMILES C[C@H](Nc1cc(ccn1)-c1c(nc(C2CCNCC2)n1C)-c1cccc(c1)C(F)(F)F)c1ccccc1 |r|
Show InChI InChI=1S/C29H30F3N5/c1-19(20-7-4-3-5-8-20)35-25-18-23(13-16-34-25)27-26(22-9-6-10-24(17-22)29(30,31)32)36-28(37(27)2)21-11-14-33-15-12-21/h3-10,13,16-19,21,33H,11-12,14-15H2,1-2H3,(H,34,35)/t19-/m0/s1
NCI pathway
Reactome pathway
n/an/a 1.17E+3n/an/an/an/an/an/a
Eberhard-Karls-University Tuebingen
Curated by ChEMBL
Assay Description
Inhibition of JNK2alpha1
J Med Chem 51: 4122-49 (2008)
Article DOI: 10.1021/jm701529q
BindingDB Entry DOI: 10.7270/Q2W37X67
Tyrosine-protein kinase Lck
(Homo sapiens (Human))
BDBM15459
(4-[1-methyl-2-(piperidin-4-yl)-4-[3-(trifluorometh...)
Show SMILES C[C@H](Nc1cc(ccn1)-c1c(nc(C2CCNCC2)n1C)-c1cccc(c1)C(F)(F)F)c1ccccc1 |r|
Show InChI InChI=1S/C29H30F3N5/c1-19(20-7-4-3-5-8-20)35-25-18-23(13-16-34-25)27-26(22-9-6-10-24(17-22)29(30,31)32)36-28(37(27)2)21-11-14-33-15-12-21/h3-10,13,16-19,21,33H,11-12,14-15H2,1-2H3,(H,34,35)/t19-/m0/s1
n/an/a>1.00E+4n/an/an/an/an/an/a
Merck Research Laboratories
Curated by ChEMBL
Assay Description
Inhibition of p56 Lck tyrosine kinase
J Med Chem 42: 2180-90 (1999)
Article DOI: 10.1021/jm9805236
BindingDB Entry DOI: 10.7270/Q2Q81C8D
Mitogen-activated protein kinase 14
(Homo sapiens (Human))
BDBM15459
(4-[1-methyl-2-(piperidin-4-yl)-4-[3-(trifluorometh...)
Show SMILES C[C@H](Nc1cc(ccn1)-c1c(nc(C2CCNCC2)n1C)-c1cccc(c1)C(F)(F)F)c1ccccc1 |r|
Show InChI InChI=1S/C29H30F3N5/c1-19(20-7-4-3-5-8-20)35-25-18-23(13-16-34-25)27-26(22-9-6-10-24(17-22)29(30,31)32)36-28(37(27)2)21-11-14-33-15-12-21/h3-10,13,16-19,21,33H,11-12,14-15H2,1-2H3,(H,34,35)/t19-/m0/s1
NCI pathway
Reactome pathway
n/an/a 0.100n/an/an/an/an/an/a
Merck Research Laboratories
Curated by ChEMBL
Assay Description
Inhibition of wild type p38alpha (unknown origin)
J Biol Chem 282: 34663-71 (2007)
Article DOI: 10.1074/jbc.M704236200
BindingDB Entry DOI: 10.7270/Q2G44Q2F
3D
3D Structure (docked)
Mitogen-activated protein kinase 11
(Homo sapiens (Human))
BDBM15459
(4-[1-methyl-2-(piperidin-4-yl)-4-[3-(trifluorometh...)
Show SMILES C[C@H](Nc1cc(ccn1)-c1c(nc(C2CCNCC2)n1C)-c1cccc(c1)C(F)(F)F)c1ccccc1 |r|
Show InChI InChI=1S/C29H30F3N5/c1-19(20-7-4-3-5-8-20)35-25-18-23(13-16-34-25)27-26(22-9-6-10-24(17-22)29(30,31)32)36-28(37(27)2)21-11-14-33-15-12-21/h3-10,13,16-19,21,33H,11-12,14-15H2,1-2H3,(H,34,35)/t19-/m0/s1
Reactome pathway
n/an/a 0.100n/an/an/an/an/an/a
Merck Research Laboratories
Curated by ChEMBL
Assay Description
Inhibition of wild type p38beta (unknown origin)
J Biol Chem 282: 34663-71 (2007)
Article DOI: 10.1074/jbc.M704236200
BindingDB Entry DOI: 10.7270/Q2G44Q2F
RAF proto-oncogene serine/threonine-protein kinase
(Homo sapiens (Human))
BDBM15459
(4-[1-methyl-2-(piperidin-4-yl)-4-[3-(trifluorometh...)
Show SMILES C[C@H](Nc1cc(ccn1)-c1c(nc(C2CCNCC2)n1C)-c1cccc(c1)C(F)(F)F)c1ccccc1 |r|
Show InChI InChI=1S/C29H30F3N5/c1-19(20-7-4-3-5-8-20)35-25-18-23(13-16-34-25)27-26(22-9-6-10-24(17-22)29(30,31)32)36-28(37(27)2)21-11-14-33-15-12-21/h3-10,13,16-19,21,33H,11-12,14-15H2,1-2H3,(H,34,35)/t19-/m0/s1
NCI pathway
Reactome pathway
n/an/a 810n/an/an/an/an/an/a
Eberhard-Karls-University Tuebingen
Curated by ChEMBL
Assay Description
Inhibition of human c-RAF at 10 uM
J Med Chem 51: 4122-49 (2008)
Article DOI: 10.1021/jm701529q
BindingDB Entry DOI: 10.7270/Q2W37X67
Epidermal growth factor receptor
(Homo sapiens (Human))
BDBM15459
(4-[1-methyl-2-(piperidin-4-yl)-4-[3-(trifluorometh...)
Show SMILES C[C@H](Nc1cc(ccn1)-c1c(nc(C2CCNCC2)n1C)-c1cccc(c1)C(F)(F)F)c1ccccc1 |r|
Show InChI InChI=1S/C29H30F3N5/c1-19(20-7-4-3-5-8-20)35-25-18-23(13-16-34-25)27-26(22-9-6-10-24(17-22)29(30,31)32)36-28(37(27)2)21-11-14-33-15-12-21/h3-10,13,16-19,21,33H,11-12,14-15H2,1-2H3,(H,34,35)/t19-/m0/s1
n/an/a>1.00E+4n/an/an/an/an/an/a
Merck Research Laboratories
Curated by ChEMBL
Assay Description
Inhibition of EGF receptor kinase
J Med Chem 42: 2180-90 (1999)
Article DOI: 10.1021/jm9805236
BindingDB Entry DOI: 10.7270/Q2Q81C8D