BDBM155032 US9000044, 51
SMILES: Cc1c(CC(O)=O)cc2ccc(F)cc2c1-c1ccc(cc1)S(=O)(=O)NCc1ccccc1
InChI Key: InChIKey=KQVHKZQVBMYITM-UHFFFAOYSA-N
Data: 1 IC50
Activity Spreadsheet -- Enzyme Inhibition Constant Data from BindingDB
Found 1 hit for monomerid = 155032
Trg + Lig
Ki
nM
ΔG°
kcal/mole
IC50
nM
Kd
nM
EC50/IC50
nM
koff
s-1
kon
M-1s-1
pHTemp
°C
G protein-coupled receptor 44
(Homo sapiens (Human))
BDBM155032
(US9000044, 51)
Show SMILES Cc1c(CC(O)=O)cc2ccc(F)cc2c1-c1ccc(cc1)S(=O)(=O)NCc1ccccc1
Show InChI InChI=1S/C26H22FNO4S/c1-17-21(14-25(29)30)13-20-7-10-22(27)15-24(20)26(17)19-8-11-23(12-9-19)33(31,32)28-16-18-5-3-2-4-6-18/h2-13,15,28H,14,16H2,1H3,(H,29,30)
Reactome pathway
US Patent
n/an/a 0.400n/an/an/an/an/an/a
Hoffmann-La Roche Inc.
US Patent
Assay Description
Cell Culture Conditions: CHO-K1 cells previously transfected with G-alpha 16 were subsequently transfected with the human CRTH2 receptor and the neom...
US Patent US9000044 (2015)
BindingDB Entry DOI: 10.7270/Q2319TM9