BDBM155385 US9006282, Example 3, Compound 4
SMILES: CCCOC1C[C@H](O)C[C@@H](CCn2c(C(C)C)c(C(=O)Nc3ccccc3)c(c2-c2ccc(F)cc2)-c2ccccc2)O1
InChI Key: InChIKey=QSPZJDGFFMSQPC-KCUXUGRMSA-N
Data: 1 IC50
Activity Spreadsheet -- Enzyme Inhibition Constant Data from BindingDB
Found 1 hit for monomerid = 155385
Trg + Lig
Ki
nM
ΔG°
kcal/mole
IC50
nM
Kd
nM
EC50/IC50
nM
koff
s-1
kon
M-1s-1
pHTemp
°C
HMG-CoA reductase
(Rattus norvegicus (rat))
BDBM155385
(US9006282, Example 3, Compound 4)
Show SMILES CCCOC1C[C@H](O)C[C@@H](CCn2c(C(C)C)c(C(=O)Nc3ccccc3)c(c2-c2ccc(F)cc2)-c2ccccc2)O1 |r|
Show InChI InChI=1S/C36H41FN2O4/c1-4-21-42-31-23-29(40)22-30(43-31)19-20-39-34(24(2)3)33(36(41)38-28-13-9-6-10-14-28)32(25-11-7-5-8-12-25)35(39)26-15-17-27(37)18-16-26/h5-18,24,29-31,40H,4,19-23H2,1-3H3,(H,38,41)/t29-,30-,31?/m1/s1
Reactome pathway
US Patent
n/an/a<1n/an/an/an/a7.2n/a
Redx Pharma Limited
US Patent
Assay Description
All assays were carried out in a reaction buffer containing 100 nM KxPO4 at pH 7.2, 1 mM EDTA, 500 mM KCl and 1 mg/ml BSA. The concentrations of NADP...
US Patent US9006282 (2015)
BindingDB Entry DOI: 10.7270/Q28K77T8