BDBM15622 4-(4-(3-Chlorophenyl)-1H-pyrazol-3-yl)-N-((pyridin-3-yl)-methyl)-1H-pyrrole-2-carboxamide::4-[4-(3-chlorophenyl)-1H-pyrazol-3-yl]-N-(pyridin-3-ylmethyl)-1H-pyrrole-2-carboxamide::Pyrrole Carboxamide Analog 5h
SMILES: Clc1cccc(c1)-c1c[nH]nc1-c1c[nH]c(c1)C(=O)NCc1cccnc1
InChI Key: InChIKey=IKSOSHYRFLZPCI-UHFFFAOYSA-N
Data: 1 KI
Activity Spreadsheet -- Enzyme Inhibition Constant Data from BindingDB
Found 1 hit for monomerid = 15622
Trg + Lig
Ki
nM
ΔG°
kcal/mole
IC50
nM
Kd
nM
EC50/IC50
nM
koff
s-1
kon
M-1s-1
pHTemp
°C
Mitogen-activated protein kinase 1
(Homo sapiens (Human))
BDBM15622
(4-(4-(3-Chlorophenyl)-1H-pyrazol-3-yl)-N-((pyridin...)
Show SMILES Clc1cccc(c1)-c1c[nH]nc1-c1c[nH]c(c1)C(=O)NCc1cccnc1
Show InChI InChI=1S/C20H16ClN5O/c21-16-5-1-4-14(7-16)17-12-25-26-19(17)15-8-18(23-11-15)20(27)24-10-13-3-2-6-22-9-13/h1-9,11-12,23H,10H2,(H,24,27)(H,25,26)
NCI pathway
Reactome pathway
230 -9.20n/an/an/an/an/a7.530
Vertex
Assay Description
A coupled spectrophotometric assay was used in which ADP generated by ERK2 was converted to ATP by pyruvate kinase with the production of pyruvate fr...
J Med Chem 50: 1280-7 (2007)
Article DOI: 10.1021/jm061381f
BindingDB Entry DOI: 10.7270/Q2BR8QFV