BDBM15625 4-[4-(3-chlorophenyl)-1H-pyrazol-3-yl]-N-[(3,4-difluorophenyl)methyl]-1H-pyrrole-2-carboxamide::N-(3,4-Difluorobenzyl)-4-(4-(3-chlorophenyl)-1H-pyrazol-3-1H-pyrrole-2-carboxamide::Pyrrole Carboxamide Analog 5k
SMILES: Fc1ccc(CNC(=O)c2cc(c[nH]2)-c2n[nH]cc2-c2cccc(Cl)c2)cc1F
InChI Key: InChIKey=JNPMSEMUYZIVNF-UHFFFAOYSA-N
Data: 2 KI
PDB links: 3 PDB IDs contain inhibitors having a similarity of 90% to this monomer.
Activity Spreadsheet -- Enzyme Inhibition Constant Data from BindingDB
Found 2 hits for monomerid = 15625
Trg + Lig
Ki
nM
ΔG°
kcal/mole
IC50
nM
Kd
nM
EC50/IC50
nM
koff
s-1
kon
M-1s-1
pHTemp
°C
Mitogen-activated protein kinase 1
(Homo sapiens (Human))
BDBM15625
(4-[4-(3-chlorophenyl)-1H-pyrazol-3-yl]-N-[(3,4-dif...)
Show SMILES Fc1ccc(CNC(=O)c2cc(c[nH]2)-c2n[nH]cc2-c2cccc(Cl)c2)cc1F
Show InChI InChI=1S/C21H15ClF2N4O/c22-15-3-1-2-13(7-15)16-11-27-28-20(16)14-8-19(25-10-14)21(29)26-9-12-4-5-17(23)18(24)6-12/h1-8,10-11,25H,9H2,(H,26,29)(H,27,28)
NCI pathway
Reactome pathway
40 -10.3n/an/an/an/an/a7.530
Vertex
Assay Description
A coupled spectrophotometric assay was used in which ADP generated by ERK2 was converted to ATP by pyruvate kinase with the production of pyruvate fr...
J Med Chem 50: 1280-7 (2007)
Article DOI: 10.1021/jm061381f
BindingDB Entry DOI: 10.7270/Q2BR8QFV
Mitogen-activated protein kinase 10
(Homo sapiens (Human))
BDBM15625
(4-[4-(3-chlorophenyl)-1H-pyrazol-3-yl]-N-[(3,4-dif...)
Show SMILES Fc1ccc(CNC(=O)c2cc(c[nH]2)-c2n[nH]cc2-c2cccc(Cl)c2)cc1F
Show InChI InChI=1S/C21H15ClF2N4O/c22-15-3-1-2-13(7-15)16-11-27-28-20(16)14-8-19(25-10-14)21(29)26-9-12-4-5-17(23)18(24)6-12/h1-8,10-11,25H,9H2,(H,26,29)(H,27,28)
NCI pathway
Reactome pathway
790n/an/an/an/an/an/an/an/a
Vertex
Assay Description
A coupled spectrophotometric assay was used in which ADP generated by JNK3 was converted to ATP by pyruvate kinase with the production of pyruvate fr...
J Med Chem 50: 1280-7 (2007)
Article DOI: 10.1021/jm061381f
BindingDB Entry DOI: 10.7270/Q2BR8QFV