BDBM15629 N-(Benzyloxy)-4-(4-(3-chlorophenyl)-1H-pyrazol-3-yl)-1Hpyrrole-2-carboxamide::N-(benzyloxy)-4-[4-(3-chlorophenyl)-1H-pyrazol-3-yl]-1H-pyrrole-2-carboxamide::Pyrrole Carboxamide Analog 5o
SMILES: Clc1cccc(c1)-c1c[nH]nc1-c1c[nH]c(c1)C(=O)NOCc1ccccc1
InChI Key: InChIKey=CVYVCWOKSDKRHQ-UHFFFAOYSA-N
Data: 2 KI
Activity Spreadsheet -- Enzyme Inhibition Constant Data from BindingDB
Found 2 hits for monomerid = 15629
Trg + Lig
Ki
nM
ΔG°
kcal/mole
IC50
nM
Kd
nM
EC50/IC50
nM
koff
s-1
kon
M-1s-1
pHTemp
°C
Mitogen-activated protein kinase 1
(Homo sapiens (Human))
BDBM15629
(N-(Benzyloxy)-4-(4-(3-chlorophenyl)-1H-pyrazol-3-y...)
Show SMILES Clc1cccc(c1)-c1c[nH]nc1-c1c[nH]c(c1)C(=O)NOCc1ccccc1
Show InChI InChI=1S/C21H17ClN4O2/c22-17-8-4-7-15(9-17)18-12-24-25-20(18)16-10-19(23-11-16)21(27)26-28-13-14-5-2-1-3-6-14/h1-12,23H,13H2,(H,24,25)(H,26,27)
NCI pathway
Reactome pathway
170 -9.38n/an/an/an/an/a7.530
Vertex
Assay Description
A coupled spectrophotometric assay was used in which ADP generated by ERK2 was converted to ATP by pyruvate kinase with the production of pyruvate fr...
J Med Chem 50: 1280-7 (2007)
Article DOI: 10.1021/jm061381f
BindingDB Entry DOI: 10.7270/Q2BR8QFV
Mitogen-activated protein kinase 10
(Homo sapiens (Human))
BDBM15629
(N-(Benzyloxy)-4-(4-(3-chlorophenyl)-1H-pyrazol-3-y...)
Show SMILES Clc1cccc(c1)-c1c[nH]nc1-c1c[nH]c(c1)C(=O)NOCc1ccccc1
Show InChI InChI=1S/C21H17ClN4O2/c22-17-8-4-7-15(9-17)18-12-24-25-20(18)16-10-19(23-11-16)21(27)26-28-13-14-5-2-1-3-6-14/h1-12,23H,13H2,(H,24,25)(H,26,27)
NCI pathway
Reactome pathway
2.90E+3n/an/an/an/an/an/an/an/a
Vertex
Assay Description
A coupled spectrophotometric assay was used in which ADP generated by JNK3 was converted to ATP by pyruvate kinase with the production of pyruvate fr...
J Med Chem 50: 1280-7 (2007)
Article DOI: 10.1021/jm061381f
BindingDB Entry DOI: 10.7270/Q2BR8QFV