BDBM1563 2-cyclopropyl-9-methyl-5-(1H-pyrazol-4-yl)-2,4,9,15-tetraazatricyclo[9.4.0.0^{3,8}]pentadeca-1(11),3,5,7,12,14-hexaen-10-one::Dipyridodiazepinone deriv. 54
SMILES: CN1c2ccc(nc2N(C2CC2)c2ncccc2C1=O)-c1cn[nH]c1
InChI Key: InChIKey=YSHVGBBWHQFDTL-UHFFFAOYSA-N
Data: 2 IC50
Activity Spreadsheet -- Enzyme Inhibition Constant Data from BindingDB
Found 2 hits for monomerid = 1563
Trg + Lig
Ki
nM
ΔG°
kcal/mole
IC50
nM
Kd
nM
EC50/IC50
nM
koff
s-1
kon
M-1s-1
pHTemp
°C
HIV-1 Reverse Transcriptase Mutant (Y181C)
(Human immunodeficiency virus type 1)
BDBM1563
(2-cyclopropyl-9-methyl-5-(1H-pyrazol-4-yl)-2,4,9,1...)
Show SMILES CN1c2ccc(nc2N(C2CC2)c2ncccc2C1=O)-c1cn[nH]c1
Show InChI InChI=1S/C18H16N6O/c1-23-15-7-6-14(11-9-20-21-10-11)22-17(15)24(12-4-5-12)16-13(18(23)25)3-2-8-19-16/h2-3,6-10,12H,4-5H2,1H3,(H,20,21)
n/an/a 50n/an/an/an/an/an/a
Boehringer Ingelheim Pharmaceuticals Inc.
Assay Description
The IC50 of reverse transcriptase is the concentration that inhibits 50% of recombinant HIV-1 RT RNA-directed DNA polymerase activity in vitro.
J Med Chem 38: 4830-8 (1995)
Article DOI: 10.1021/jm00024a010
BindingDB Entry DOI: 10.7270/Q23B5XBJ
HIV-1 Reverse Transcriptase
(Human immunodeficiency virus type 1)
BDBM1563
(2-cyclopropyl-9-methyl-5-(1H-pyrazol-4-yl)-2,4,9,1...)
Show SMILES CN1c2ccc(nc2N(C2CC2)c2ncccc2C1=O)-c1cn[nH]c1
Show InChI InChI=1S/C18H16N6O/c1-23-15-7-6-14(11-9-20-21-10-11)22-17(15)24(12-4-5-12)16-13(18(23)25)3-2-8-19-16/h2-3,6-10,12H,4-5H2,1H3,(H,20,21)
n/an/a 60n/an/an/an/an/an/a
Boehringer Ingelheim Pharmaceuticals Inc.
Assay Description
The IC50 of reverse transcriptase is the concentration that inhibits 50% of recombinant HIV-1 RT RNA-directed DNA polymerase activity in vitro.
J Med Chem 38: 4830-8 (1995)
Article DOI: 10.1021/jm00024a010
BindingDB Entry DOI: 10.7270/Q23B5XBJ