BDBM156402 US9018381, 25::US9248140, 25
SMILES: OC[C@H]1COCCN1CC[C@H](CSc1ccccc1)Nc1ccc(cc1S(=O)(=O)C(F)(F)F)S(=O)(=O)NC(=O)c1ccc(cc1)N1CCC(CC1)[C@@H](O)c1ccccc1-c1ccc(Cl)cc1
InChI Key: InChIKey=PULZXBWWMHLNGW-SQKNJAOPSA-N
Data: 4 IC50
Activity Spreadsheet -- Enzyme Inhibition Constant Data from BindingDB
Found 4 hits for monomerid = 156402
Trg + Lig
Ki
nM
ΔG°
kcal/mole
IC50
nM
Kd
nM
EC50/IC50
nM
koff
s-1
kon
M-1s-1
pHTemp
°C
Bcl-2-like protein 1
(Homo sapiens (Human))
BDBM156402
(US9018381, 25 | US9248140, 25)
Show SMILES OC[C@H]1COCCN1CC[C@H](CSc1ccccc1)Nc1ccc(cc1S(=O)(=O)C(F)(F)F)S(=O)(=O)NC(=O)c1ccc(cc1)N1CCC(CC1)[C@@H](O)c1ccccc1-c1ccc(Cl)cc1 |r|
Show InChI InChI=1S/C47H50ClF3N4O8S3/c48-35-14-10-32(11-15-35)41-8-4-5-9-42(41)45(57)33-20-23-54(24-21-33)37-16-12-34(13-17-37)46(58)53-66(61,62)40-18-19-43(44(28-40)65(59,60)47(49,50)51)52-36(31-64-39-6-2-1-3-7-39)22-25-55-26-27-63-30-38(55)29-56/h1-19,28,33,36,38,45,52,56-57H,20-27,29-31H2,(H,53,58)/t36-,38+,45-/m1/s1
NCI pathway
Reactome pathway
US Patent
n/an/a 2n/an/an/an/an/an/a
AstraZeneca AB
US Patent
Assay Description
Bcl-xL and Bcl-2 FP binding affinity of compound(s) of Formulae (I), (I-a), (I-b), (I-c), (I-d) and/or (I-e) may be determined using a variety of kno...
US Patent US9018381 (2015)
BindingDB Entry DOI: 10.7270/Q2BC3X8D
Apoptosis regulator Bcl-2
(Homo sapiens (Human))
BDBM156402
(US9018381, 25 | US9248140, 25)
Show SMILES OC[C@H]1COCCN1CC[C@H](CSc1ccccc1)Nc1ccc(cc1S(=O)(=O)C(F)(F)F)S(=O)(=O)NC(=O)c1ccc(cc1)N1CCC(CC1)[C@@H](O)c1ccccc1-c1ccc(Cl)cc1 |r|
Show InChI InChI=1S/C47H50ClF3N4O8S3/c48-35-14-10-32(11-15-35)41-8-4-5-9-42(41)45(57)33-20-23-54(24-21-33)37-16-12-34(13-17-37)46(58)53-66(61,62)40-18-19-43(44(28-40)65(59,60)47(49,50)51)52-36(31-64-39-6-2-1-3-7-39)22-25-55-26-27-63-30-38(55)29-56/h1-19,28,33,36,38,45,52,56-57H,20-27,29-31H2,(H,53,58)/t36-,38+,45-/m1/s1
US Patent
n/an/a 0.400n/an/an/an/a7.5n/a
AstraZeneca AB
US Patent
Assay Description
Bcl-xL and Bcl-2 FP binding affinity of compound(s) of Formulae (I), (I-a), (I-b), (I-c), (I-d) and/or (I-c) may be determined using a variety of kno...
US Patent US9248140 (2016)
BindingDB Entry DOI: 10.7270/Q21G0K34
Apoptosis regulator Bcl-XL
(Homo sapiens (Human))
BDBM156402
(US9018381, 25 | US9248140, 25)
Show SMILES OC[C@H]1COCCN1CC[C@H](CSc1ccccc1)Nc1ccc(cc1S(=O)(=O)C(F)(F)F)S(=O)(=O)NC(=O)c1ccc(cc1)N1CCC(CC1)[C@@H](O)c1ccccc1-c1ccc(Cl)cc1 |r|
Show InChI InChI=1S/C47H50ClF3N4O8S3/c48-35-14-10-32(11-15-35)41-8-4-5-9-42(41)45(57)33-20-23-54(24-21-33)37-16-12-34(13-17-37)46(58)53-66(61,62)40-18-19-43(44(28-40)65(59,60)47(49,50)51)52-36(31-64-39-6-2-1-3-7-39)22-25-55-26-27-63-30-38(55)29-56/h1-19,28,33,36,38,45,52,56-57H,20-27,29-31H2,(H,53,58)/t36-,38+,45-/m1/s1
US Patent
n/an/a 2n/an/an/an/a7.5n/a
AstraZeneca AB
US Patent
Assay Description
Bcl-xL and Bcl-2 FP binding affinity of compound(s) of Formulae (I), (I-a), (I-b), (I-c), (I-d) and/or (I-c) may be determined using a variety of kno...
US Patent US9248140 (2016)
BindingDB Entry DOI: 10.7270/Q21G0K34
Apoptosis regulator Bcl-2
(Homo sapiens (Human))
BDBM156402
(US9018381, 25 | US9248140, 25)
Show SMILES OC[C@H]1COCCN1CC[C@H](CSc1ccccc1)Nc1ccc(cc1S(=O)(=O)C(F)(F)F)S(=O)(=O)NC(=O)c1ccc(cc1)N1CCC(CC1)[C@@H](O)c1ccccc1-c1ccc(Cl)cc1 |r|
Show InChI InChI=1S/C47H50ClF3N4O8S3/c48-35-14-10-32(11-15-35)41-8-4-5-9-42(41)45(57)33-20-23-54(24-21-33)37-16-12-34(13-17-37)46(58)53-66(61,62)40-18-19-43(44(28-40)65(59,60)47(49,50)51)52-36(31-64-39-6-2-1-3-7-39)22-25-55-26-27-63-30-38(55)29-56/h1-19,28,33,36,38,45,52,56-57H,20-27,29-31H2,(H,53,58)/t36-,38+,45-/m1/s1
US Patent
n/an/a 0.400n/an/an/an/an/an/a
AstraZeneca AB
US Patent
Assay Description
Bcl-xL and Bcl-2 FP binding affinity of compound(s) of Formulae (I), (I-a), (I-b), (I-c), (I-d) and/or (I-e) may be determined using a variety of kno...
US Patent US9018381 (2015)
BindingDB Entry DOI: 10.7270/Q2BC3X8D