BDBM1566 2-ethyl-5-(3-methoxyphenyl)-9-methyl-2,4,9,15-tetraazatricyclo[9.4.0.0^{3,8}]pentadeca-1(11),3,5,7,12,14-hexaen-10-one::Dipyridodiazepinone deriv. 57
SMILES: CCN1c2nc(ccc2N(C)C(=O)c2cccnc12)-c1cccc(OC)c1
InChI Key: InChIKey=BJAUUCPOEAUGFQ-UHFFFAOYSA-N
Data: 2 IC50
Activity Spreadsheet -- Enzyme Inhibition Constant Data from BindingDB
Found 2 hits for monomerid = 1566
Trg + Lig
Ki
nM
ΔG°
kcal/mole
IC50
nM
Kd
nM
EC50/IC50
nM
koff
s-1
kon
M-1s-1
pHTemp
°C
HIV-1 Reverse Transcriptase Mutant (Y181C)
(Human immunodeficiency virus type 1)
BDBM1566
(2-ethyl-5-(3-methoxyphenyl)-9-methyl-2,4,9,15-tetr...)
Show SMILES CCN1c2nc(ccc2N(C)C(=O)c2cccnc12)-c1cccc(OC)c1
Show InChI InChI=1S/C21H20N4O2/c1-4-25-19-16(9-6-12-22-19)21(26)24(2)18-11-10-17(23-20(18)25)14-7-5-8-15(13-14)27-3/h5-13H,4H2,1-3H3
n/an/a 210n/an/an/an/an/an/a
Boehringer Ingelheim Pharmaceuticals Inc.
Assay Description
The IC50 of reverse transcriptase is the concentration that inhibits 50% of recombinant HIV-1 RT RNA-directed DNA polymerase activity in vitro.
J Med Chem 38: 4830-8 (1995)
Article DOI: 10.1021/jm00024a010
BindingDB Entry DOI: 10.7270/Q23B5XBJ
HIV-1 Reverse Transcriptase
(Human immunodeficiency virus type 1)
BDBM1566
(2-ethyl-5-(3-methoxyphenyl)-9-methyl-2,4,9,15-tetr...)
Show SMILES CCN1c2nc(ccc2N(C)C(=O)c2cccnc12)-c1cccc(OC)c1
Show InChI InChI=1S/C21H20N4O2/c1-4-25-19-16(9-6-12-22-19)21(26)24(2)18-11-10-17(23-20(18)25)14-7-5-8-15(13-14)27-3/h5-13H,4H2,1-3H3
n/an/a 150n/an/an/an/an/an/a
Boehringer Ingelheim Pharmaceuticals Inc.
Assay Description
The IC50 of reverse transcriptase is the concentration that inhibits 50% of recombinant HIV-1 RT RNA-directed DNA polymerase activity in vitro.
J Med Chem 38: 4830-8 (1995)
Article DOI: 10.1021/jm00024a010
BindingDB Entry DOI: 10.7270/Q23B5XBJ