BDBM15718 (5-Amino-1-O-tolyl-1H-pyrazol-4-yl)phenylmethanone::4-benzoyl-1-(2-methylphenyl)-1H-pyrazol-5-amine::aminopyrazole 9
SMILES: Cc1ccccc1-n1ncc(C(=O)c2ccccc2)c1N
InChI Key: InChIKey=WYGCUSHOHRVKKS-UHFFFAOYSA-N
Data: 1 IC50
Activity Spreadsheet -- Enzyme Inhibition Constant Data from BindingDB
Found 1 hit for monomerid = 15718
Trg + Lig
Ki
nM
ΔG°
kcal/mole
IC50
nM
Kd
nM
EC50/IC50
nM
koff
s-1
kon
M-1s-1
pHTemp
°C
Mitogen-activated protein kinase 14
(Homo sapiens (Human))
BDBM15718
((5-Amino-1-O-tolyl-1H-pyrazol-4-yl)phenylmethanone...)
Show SMILES Cc1ccccc1-n1ncc(C(=O)c2ccccc2)c1N
Show InChI InChI=1S/C17H15N3O/c1-12-7-5-6-10-15(12)20-17(18)14(11-19-20)16(21)13-8-3-2-4-9-13/h2-11H,18H2,1H3
NCI pathway
Reactome pathway
n/an/a 1.08E+3n/an/an/an/a7.430
Roche Palo Alto LLC
Assay Description
Inhibition of human recombinant active p38alpha MAP kinase was tested by measuring the incorporation of 33P from gamma-[33P] ATP into myelin basic pr...
J Med Chem 49: 1562-75 (2006)
Article DOI: 10.1021/jm050736c
BindingDB Entry DOI: 10.7270/Q23776ZN