BDBM157207 US9023865, 53
SMILES: Cc1cc(ccn1)-c1n[nH]c2cc(NC(=O)NCc3cccc(F)c3)ncc12
InChI Key: InChIKey=NUJQZAPOPJQTKN-UHFFFAOYSA-N
Data: 1 IC50
Activity Spreadsheet -- Enzyme Inhibition Constant Data from BindingDB
Found 1 hit for monomerid = 157207
Trg + Lig
Ki
nM
ΔG°
kcal/mole
IC50
nM
Kd
nM
EC50/IC50
nM
koff
s-1
kon
M-1s-1
pHTemp
°C
Mitogen-activated protein kinase 1
(Homo sapiens (Human))
BDBM157207
(US9023865, 53)
Show SMILES Cc1cc(ccn1)-c1n[nH]c2cc(NC(=O)NCc3cccc(F)c3)ncc12
Show InChI InChI=1S/C20H17FN6O/c1-12-7-14(5-6-22-12)19-16-11-23-18(9-17(16)26-27-19)25-20(28)24-10-13-3-2-4-15(21)8-13/h2-9,11H,10H2,1H3,(H,26,27)(H2,23,24,25,28)
NCI pathway
Reactome pathway
US Patent
n/an/a 0.245n/an/an/an/an/an/a
Merck Sharp & Dohme Corp.
US Patent
Assay Description
Activated ERK2 activity was determined in an IMAP-FP assay (Molecular Devices). Using this assay format, the potency (IC50) of each compound was dete...
US Patent US9023865 (2015)
BindingDB Entry DOI: 10.7270/Q2PN94CC